program: Gaussian 09
title: 000104071
version: EM64L-G09RevD.01
frameworkgroup: C1[X(C11H14N4O4)]
method: RPBEPBE
basis: SDD
operation: Freq
keyword: #p
keyword: freq=noraman
keyword: PBEPBE/SDD
title: #p freq=noraman PBEPBE/SDD
converged: YES YES NO NO
title: Mulliken charges:
elementType: O O O O N N N N C C C C C C C C C C C H H H H H H H H H H H H H H
charge: -0.285351 -0.266864 -0.414793 -0.225882 -0.150134 -0.148989 -0.224882 -0.090552 0.143412 -0.374544 0.068547 -0.376900 0.190170 -0.213992 0.211057 -0.477082 -0.610247 -0.601587 0.179011 0.209454 0.255692 0.234990 0.266906 0.267810 0.246080 0.271130 0.270696 0.248553 0.247982 0.267146 0.251954 0.251317 0.379891
chargesum: 0.00000
title: Mulliken charges with hydrogens summed into heavy atoms:
elementType: O O O O N N N N C C C C C C C C C C C
charge: -0.285351 -0.266864 -0.034902 -0.225882 -0.150134 -0.148989 -0.224882 -0.090552 0.143412 0.090602 0.068547 0.124996 0.190170 0.053819 0.211057 0.040128 0.156985 0.168830 0.179011
polarizability: 2.01324949e+02 -1.42595989e+00 1.68203783e+02 -2.18317297e+01 -3.20988563e+00 1.06551259e+02
1716.lowfreq: -5.8988 -2.6131 0.0003 0.0005 0.0007 4.5095 21.0934 25.2240 33.0831
frequency: 21.0683 25.2144 33.0813 69.1150 74.7881 88.3343 96.5828 104.9864 114.3195 128.1754 157.5474 182.0639 205.4851 240.9314 291.7189 294.0384 315.5196 346.9662 375.1017 385.7474 401.0948 431.0313 460.2664 493.0554 506.2176 539.1773 583.1401 615.7031 639.8391 642.4850 669.2922 704.3882 739.3723 747.1706 748.1359 780.4052 806.4530 855.3470 870.4278 911.2656 958.3320 1008.7620 1023.5843 1048.7127 1064.0686 1073.5415 1091.5719 1130.0000 1131.9193 1144.3357 1166.2822 1197.3841 1221.0986 1229.6529 1242.2909 1256.9377 1266.9220 1282.2450 1300.8508 1305.3845 1348.2889 1361.0538 1375.1256 1383.2573 1411.4682 1424.9944 1428.3509 1441.1606 1459.2196 1473.2112 1474.2176 1477.7262 1478.1450 1480.0294 1505.8190 1571.3202 1613.7253 1645.8441 1670.6489 2987.1434 3008.6714 3010.2036 3013.3706 3021.1808 3045.3491 3070.8206 3095.1035 3098.4926 3105.2290 3140.0033 3140.5894 3238.6753 3514.8001
redmass: 10.5001 6.4353 7.0893 1.0694 2.0974 3.9151 3.0628 3.3043 1.1678 3.6855 6.1695 5.6952 3.0657 5.8567 4.4186 3.3384 5.3776 3.4091 6.9089 7.3147 6.3713 7.4727 5.1264 3.6555 2.1815 5.6276 4.6676 4.4135 1.9444 2.5095 8.7053 10.7666 5.0191 6.6923 1.2507 5.6081 1.4990 1.5285 4.4619 3.8141 6.1621 2.9550 3.2594 3.1651 2.8908 2.0917 2.6291 1.3007 1.3026 1.5347 2.0512 3.0888 2.8234 2.1476 1.4150 2.0809 3.1464 1.3761 6.6479 1.3377 3.0494 1.4473 2.8404 1.7559 1.5951 1.4149 1.5636 1.0861 1.4290 1.0473 1.1496 1.0761 1.0461 1.1274 2.7109 8.2522 10.8195 9.9469 8.3436 1.0631 1.0336 1.0601 1.0328 1.0613 1.0953 1.1021 1.1056 1.1026 1.1022 1.1024 1.1013 1.0988 1.0640
irintensity: 1.1379 0.4685 0.2415 0.0048 0.7329 0.0810 0.3597 1.7723 0.1370 7.7057 0.3872 7.0891 7.8934 4.8704 1.2766 1.4745 2.0035 12.5548 15.3848 8.3184 4.3793 13.3326 41.4794 24.1464 18.6017 4.7022 20.6179 8.5709 91.2014 48.1616 0.0163 10.4319 10.3349 5.4117 13.2680 0.5541 23.0390 1.4811 0.8422 5.5651 30.5808 79.2640 208.4401 5.6916 40.3811 7.6542 67.7891 0.3927 0.0800 2.8810 54.5052 30.0879 28.4651 20.2190 1.4853 19.3395 23.7785 23.0045 28.5967 30.0595 25.0391 90.1330 15.8327 6.6387 23.7571 57.3381 105.3154 23.2664 88.2141 14.6683 22.3173 18.6133 11.5372 33.3220 116.1174 7.0622 669.2371 337.2044 207.8806 12.5033 35.8201 18.5782 24.4435 24.1357 2.9781 0.2295 17.6382 16.9048 16.4038 0.7896 0.4508 1.4262 24.6195
temp: 298.150 k
press: 1.00000 atm
elementType: 8 8 8 8 7 7 7 7 6 6 6 6 6 6 6 6 6 6 6 1 1 1 1 1 1 1 1 1 1 1 1 1 1
symmnumber: 1
zpe: 666033.9 jmol-1
zpe.correction: 0.253679 hartree
zpe.thermalcorrener: 0.272403 hartree
zpe.thermalcorrenthalpy: 0.273347 hartree
zpe.thermalcorrgfe: 0.203969 hartree
zpe.sumelectzpe: -946.109745 hartree
zpe.sumelectthermal: -946.091021 hartree
zpe.sumelectthermalent: -946.090077 hartree
zpe.sumelectthermalfe: -946.159455 hartree
dipole: 3.1039 -2.2441 -1.9174
dipole: 4.2833
quadrupole: -108.7885 -109.3421 -115.0791
quadrupole: 1.2349 -2.3140 3.7375
quadrupole: 2.2814 1.7278 -4.0092 1.2349 -2.3140 3.7375
hfenergy: -946.3634242 hartree
pointgroup: C01 [X(C11H14N4O4)]
dipole: -1.2365616 0.8166285 -0.8023932 debye
polarizability: 200.9472917|0.3875206|168.3635709|22.6579974|1.1220082|106.7691275 unknown
InChI: InChI=1S/C11H14N4O4/c1-13-9-8(10(18)14(2)11(13)19)15(6-12-9)5-3-4-7(16)17/h6,16H,3-5H2,1-2H3
charge 0 multiplicity 1
33 atoms
O  -0.10985 -1.844442 -0.856827
O  4.295257 -1.264838 0.729392
O  -6.030709 -1.044063 0.089215
O  -4.67954 -0.281873 1.817504
N  -0.311053 1.270728 -0.737934
N  3.012004 0.672619 0.399907
N  2.100734 -1.521328 -0.05537
N  1.456507 2.550139 -0.040896
C  0.729445 0.38568 -0.409769
C  -1.668247 0.890434 -1.183852
C  1.793617 1.203768 0.006784
C  -2.546494 0.390764 -0.017153
C  0.81037 -1.050484 -0.479103
C  0.173673 2.544774 -0.493922
C  3.20541 -0.729124 0.38151
C  -3.916931 -0.083489 -0.534344
C  4.109326 1.558568 0.836272
C  2.339492 -2.983376 -0.066404
C  -4.859898 -0.457884 0.593785
H  -2.119607 1.777274 -1.666281
H  -1.563597 0.092933 -1.939829
H  -2.679762 1.189953 0.734278
H  -2.034762 -0.449783 0.482686
H  -0.422987 3.439274 -0.656991
H  -4.418827 0.701373 -1.136059
H  -3.812244 -0.959411 -1.20177
H  4.968563 0.922183 1.092321
H  3.793773 2.145973 1.714608
H  4.377153 2.255191 0.024496
H  1.417808 -3.463086 -0.42627
H  2.587437 -3.333452 0.948841
H  3.186167 -3.222663 -0.730121
H  -6.636428 -1.272233 0.845997
