program: Gaussian 09
title: 000104067
version: EM64L-G09RevD.01
frameworkgroup: C1[X(C11H22O2)]
method: RPBEPBE
basis: SDD
operation: Freq
keyword: #pfreq=noraman
keyword: PBEPBE/SDD
title: #p freq=noraman PBEPBE/SDD
converged: YES YES NO NO
title: Mulliken charges:
elementType: O O C C C C C C C C C C C H H H H H H H H H H H H H H H H H H H H H H
charge: -0.431528 -0.222899 0.339552 -0.424325 -0.472461 -0.422657 -0.389459 -0.394918 -0.390147 0.071325 -0.699273 -0.697179 -0.698442 0.217602 0.199520 0.218580 0.216004 0.197598 0.218518 0.210767 0.216719 0.208261 0.208605 0.215705 0.210868 0.208750 0.212499 0.218456 0.212112 0.215495 0.212193 0.208476 0.218411 0.212540 0.374731
chargesum: 0.00000
title: Mulliken charges with hydrogens summed into heavy atoms:
elementType: O O C C C C C C C C C C C
charge: -0.056797 -0.222899 0.339552 -0.007203 -0.037877 -0.006541 0.038028 0.021948 0.036426 0.071325 -0.059568 -0.057379 -0.059015
polarizability: 1.30897495e+02 2.71392620e-03 1.27741869e+02 1.55436972e-01 7.69392345e-01 1.14419805e+02
1716.lowfreq: -3.7069 -0.0009 -0.0004 0.0006 5.0986 10.9701 33.6932 52.3847 55.5041
frequency: 33.5028 52.2140 55.2648 65.5187 79.3191 84.9020 96.6261 113.3200 143.8441 211.4146 220.4169 228.5441 239.4601 269.9184 282.7251 290.3046 316.9219 322.3616 349.5035 364.7638 494.0407 525.4185 573.1525 610.8641 711.9845 717.9020 738.0639 749.8527 753.8597 828.5197 837.5709 873.9434 883.4595 898.2592 918.5055 959.7299 997.6526 1023.9036 1036.6456 1053.7934 1056.1465 1080.6072 1095.3872 1096.1373 1118.9352 1156.9392 1161.8174 1194.6935 1233.4165 1248.4239 1248.9543 1274.5669 1283.3622 1293.7943 1294.6854 1308.0089 1308.5902 1328.0740 1346.1937 1362.7955 1366.7101 1386.8581 1388.2052 1389.6800 1456.7391 1466.9442 1468.9172 1471.9094 1472.3459 1475.2397 1476.4419 1476.7742 1477.7179 1485.1866 1486.9858 1490.5977 1643.3497 2971.0812 2971.3967 2972.6808 2973.1184 2973.8580 2974.8951 2981.3399 2987.4769 3000.0352 3015.2547 3018.1681 3018.4579 3042.8878 3048.5895 3050.4206 3068.5723 3069.5833 3072.1862 3073.2852 3074.3677 3074.4449 3512.7034
redmass: 10.0528 3.3131 2.7199 1.7820 1.7811 2.3735 2.0042 3.3180 3.6420 1.4373 1.2128 1.1630 1.7432 1.9934 2.7458 3.3953 3.4521 2.1829 3.7482 3.8774 2.5151 3.7142 3.2489 1.2701 2.0308 1.4417 1.1296 2.3720 1.4397 1.8851 1.4484 1.5288 1.4864 1.7368 1.6544 1.8098 1.8868 2.8307 2.5193 2.6464 2.6684 1.5164 1.7672 2.2894 2.4151 2.9280 2.1744 2.3822 1.3054 1.3806 1.3168 1.4768 1.2943 1.1138 1.2387 1.2058 1.3517 1.3897 1.4920 1.4766 1.5535 1.2099 1.2114 1.2164 1.0751 1.0682 1.0720 1.0616 1.0723 1.0420 1.0438 1.0453 1.0484 1.0742 1.0762 1.0890 8.9413 1.0467 1.0441 1.0419 1.0498 1.0504 1.0535 1.0608 1.0598 1.0614 1.0987 1.0981 1.0985 1.1023 1.1011 1.1012 1.1008 1.1008 1.1007 1.0994 1.0998 1.0996 1.0640
irintensity: 0.4126 0.0139 0.0162 0.0004 0.0122 0.0603 0.0302 0.0040 0.9083 0.0485 0.0020 0.0037 0.1187 0.0062 0.2075 0.2941 0.9516 0.0135 10.8169 1.3961 16.5921 5.9598 19.9863 103.5715 22.3490 27.8433 5.0649 2.1022 8.1732 1.9547 0.4913 1.2988 2.4469 27.8941 2.6843 3.5747 12.4041 179.5464 47.5775 1.6331 1.4757 6.1042 3.7911 18.6389 6.1394 0.8730 2.7434 0.6444 0.4785 1.7522 0.9265 7.5040 1.8459 0.5602 3.1508 1.8605 1.1047 2.5038 0.0773 1.0231 0.0395 10.2870 14.4288 9.2650 0.6097 0.8667 0.4774 1.6691 8.2916 12.7207 4.5376 7.5844 15.9254 8.5987 27.1448 7.6943 198.2541 42.3464 50.4072 10.1899 18.1527 6.0974 7.9538 0.1575 92.9637 40.3683 1.7828 4.3502 2.5299 5.3398 25.2141 15.1247 28.3582 135.4695 31.8881 53.1255 83.4681 65.2450 21.4284
temp: 298.150 k
press: 1.00000 atm
elementType: 8 8 6 6 6 6 6 6 6 6 6 6 6 1 1 1 1 1 1 1 1 1 1 1 1 1 1 1 1 1 1 1 1 1 1
symmnumber: 1
zpe: 815404.0 jmol-1
zpe.correction: 0.310571 hartree
zpe.thermalcorrener: 0.327523 hartree
zpe.thermalcorrenthalpy: 0.328468 hartree
zpe.thermalcorrgfe: 0.265257 hartree
zpe.sumelectzpe: -581.747445 hartree
zpe.sumelectthermal: -581.730492 hartree
zpe.sumelectthermalent: -581.729548 hartree
zpe.sumelectthermalfe: -581.792759 hartree
dipole: -0.0234 -0.1378 -1.6506
dipole: 1.6565
quadrupole: -80.9865 -77.3008 -89.8385
quadrupole: -0.0427 -0.1787 -2.0868
quadrupole: 1.7221 5.4078 -7.1299 -0.0427 -0.1787 -2.0868
hfenergy: -582.0580157 hartree
pointgroup: C01 [X(C11H22O2)]
dipole: -0.0095146 -0.0141185 -0.6514889 debye
polarizability: 130.8819435|-0.2236906|127.6148845|0.2741355|1.5558079|114.56234 unknown
InChI: InChI=1S/C11H22O2/c1-4-7-11(8-5-2,9-6-3)10(12)13/h12H,4-9H2,1-3H3
charge 0 multiplicity 1
35 atoms
O  -0.143448 -2.57753 0.313439
O  -0.018933 -1.249496 2.200263
C  -0.001946 -0.165407 -0.054949
C  1.255001 -0.372201 -0.973052
C  0.066616 1.164448 0.756384
C  -1.275958 -0.245319 -0.967516
C  2.624018 -0.352472 -0.257018
C  0.122932 2.455728 -0.089591
C  -2.634766 -0.095204 -0.247596
C  -0.052715 -1.323518 0.951389
C  3.783662 -0.66833 -1.226629
C  0.1864 3.716347 0.801238
C  -3.820308 -0.236043 -1.227496
H  1.138466 -1.338804 -1.499708
H  1.239862 0.416579 -1.751334
H  0.947539 1.130565 1.424869
H  -0.805163 1.213616 1.436056
H  -1.186515 0.540557 -1.743917
H  -1.25706 -1.21671 -1.497702
H  2.795843 0.63739 0.208412
H  2.628124 -1.090863 0.569916
H  1.007106 2.438132 -0.757271
H  -0.766024 2.521977 -0.747571
H  -2.724921 -0.860816 0.549032
H  -2.69419 0.888891 0.256613
H  3.821989 0.0648 -2.054788
H  3.662873 -1.67271 -1.674324
H  4.759945 -0.643408 -0.708928
H  -0.702894 3.783364 1.45587
H  0.231413 4.63945 0.194666
H  1.079116 3.69554 1.454368
H  -3.7723 0.533823 -2.020972
H  -4.789143 -0.124592 -0.707224
H  -3.811976 -1.226352 -1.720462
H  -0.169846 -3.286333 1.011933
