program: Gaussian 09
title: 000104088
version: EM64L-G09RevD.01
frameworkgroup: C1[X(C15H10BrFN2O4)]
method: RPBEPBE
basis: SDD
operation: Freq
keyword: #p
keyword: freq=noraman
keyword: PBEPBE/SDD
title: #p freq=noraman PBEPBE/SDD
converged: YES YES NO NO
title: Mulliken charges:
elementType: Br F O O O O N N C C C C C C C C C C C C C C C H H H H H H H H H H
charge: 0.029279 -0.172292 -0.255277 -0.223894 -0.202086 -0.208406 -0.429519 0.015449 0.154007 0.318280 0.106444 -0.478523 0.147695 -0.317462 0.397139 -0.389325 0.193242 -0.323683 0.272966 -0.367949 -0.238275 -0.188200 -0.814159 0.321010 0.322531 0.294610 0.395627 0.266480 0.265233 0.243959 0.244727 0.300657 0.319713
chargesum: 0.00000
title: Mulliken charges with hydrogens summed into heavy atoms:
elementType: Br F O O O O N N C C C C C C C C C C C C C C C
charge: 0.029279 -0.172292 -0.255277 -0.223894 -0.202086 -0.208406 -0.033892 0.015449 0.154007 0.318280 0.106444 -0.157513 0.147695 0.005070 0.397139 -0.094714 0.193242 -0.057203 0.272966 -0.102717 0.005685 0.056527 -0.193788
polarizability: 3.03685433e+02 -1.98529251e+00 2.58371564e+02 -5.97107081e+00 1.32893922e+01 1.26804669e+02
1716.lowfreq: -8.5235 -4.8093 0.0004 0.0005 0.0008 2.3303 10.9798 26.3618 28.6410
frequency: 10.7736 26.2112 28.6046 39.1944 53.2209 58.7761 80.8185 105.5024 113.9228 133.7208 155.5593 177.4903 191.4193 206.3791 236.5440 268.9903 293.2063 331.2924 366.2188 386.5566 398.8377 427.4999 428.6898 455.0551 481.7215 495.4198 513.2742 526.8077 540.8404 568.1715 605.8788 638.5490 670.4168 672.6109 706.1317 713.1484 725.3500 749.4075 769.0554 777.7614 793.7502 809.0736 845.5952 872.9481 884.2476 896.5341 926.0173 947.4823 956.9122 965.4999 970.6870 991.7689 1020.0244 1032.3127 1079.5263 1096.7796 1103.4679 1127.0171 1158.7874 1175.6892 1198.3852 1208.0515 1224.4539 1238.8395 1249.4824 1269.1622 1280.4132 1300.4774 1363.8825 1376.8593 1385.4287 1420.6511 1427.9535 1431.8768 1441.2547 1472.6973 1509.8029 1557.4946 1575.2111 1581.1088 1612.5106 1617.3710 1629.5089 3060.9997 3095.2325 3143.2701 3153.9001 3170.7169 3170.7437 3178.7015 3182.5748 3183.8479 3198.4812
redmass: 12.5530 9.3414 11.6768 8.2491 9.9758 7.5064 8.2179 13.3823 4.7431 5.9047 6.7833 8.2973 9.0502 6.5155 7.3543 7.5497 5.7047 7.2680 7.4399 7.8511 5.4034 6.4444 4.7474 4.6795 5.4225 5.1931 5.2287 5.3782 4.8740 5.1126 5.9499 6.2271 6.9390 5.9220 6.9655 6.3530 6.6087 4.6395 1.3890 5.7476 4.4039 5.0782 5.2232 1.4537 1.4505 1.8583 5.6324 2.6513 1.9791 1.3689 1.1421 1.3258 1.3216 2.2146 2.4404 1.3479 1.9408 1.9414 1.7133 1.1132 3.0000 6.6230 1.4268 2.0592 1.8226 1.5623 2.7489 2.1593 9.8104 9.1817 6.2412 4.2863 2.8190 1.2845 2.5281 2.7005 4.0181 4.0592 5.5796 7.0317 7.1192 7.4899 2.6909 1.0600 1.0844 1.0870 1.0908 1.0956 1.1072 1.0907 1.0918 1.0993 1.0963
irintensity: 0.6329 0.1866 0.0907 1.2525 0.7734 2.3946 5.9543 2.8005 3.1593 4.2573 1.1543 1.8426 0.6619 2.4010 1.5878 1.2808 2.0724 1.6345 0.7181 3.6091 9.5295 1.2943 12.8922 6.1978 5.4882 8.6725 3.7368 0.9309 0.7602 19.2869 2.4186 42.5283 27.7027 30.3508 11.9351 14.6497 8.7954 1.9498 84.4168 11.2458 7.5576 6.4584 27.5175 0.8821 40.7072 3.1525 8.4405 45.3705 8.9130 4.1783 80.4500 0.2679 1.0305 3.4463 39.3891 65.5788 37.6066 7.7985 17.6113 8.5120 29.5841 600.6352 4.7718 18.9388 29.2699 16.7525 396.1507 149.1843 111.5204 19.9212 134.3645 22.7366 84.2260 39.4913 22.8149 57.6536 530.4672 86.8561 447.2237 112.5798 74.1855 176.4074 8.1043 6.0535 328.9004 1.2048 8.8168 8.0790 1.0744 4.3890 6.3047 3.8035 6.8677
temp: 298.150 k
press: 1.00000 atm
elementType: 35 9 8 8 8 8 7 7 6 6 6 6 6 6 6 6 6 6 6 6 6 6 6 1 1 1 1 1 1 1 1 1 1
symmnumber: 1
zpe: 590324.2 jmol-1
zpe.correction: 0.224843 hartree
zpe.thermalcorrener: 0.245119 hartree
zpe.thermalcorrenthalpy: 0.246063 hartree
zpe.thermalcorrgfe: 0.171068 hartree
zpe.sumelectzpe: -1099.618244 hartree
zpe.sumelectthermal: -1099.597968 hartree
zpe.sumelectthermalent: -1099.597024 hartree
zpe.sumelectthermalfe: -1099.672019 hartree
dipole: 1.2776 -3.4886 3.3913
dipole: 5.0303
quadrupole: -143.5630 -153.0788 -137.5976
quadrupole: -23.1247 4.4071 0.3500
quadrupole: 1.1835 -8.3323 7.1489 -23.1247 4.4071 0.3500
hfenergy: -1099.8430866 hartree
pointgroup: C01 [X(C15H10Br1F1N2O4)]
dipole: -1.0424171 1.0461058 1.3174593 debye
polarizability: 294.9598954|18.1811323|265.534017|0.892262|-20.5171101|128.367753 unknown
InChI: InChI=1S/C15H10BrFN2O4/c16-8-14(20)18-13-6-5-9(19(22)23)7-11(13)15(21)10-3-1-2-4-12(10)17/h1-7,18H,8H2
charge 0 multiplicity 1
33 atoms
Br 4.000638 3.550427 -1.230469
F  -2.221804 2.614747 -1.611471
O  0.109604 2.217915 0.073583
O  4.62334 0.282708 0.692361
O  0.206577 -4.99102 -0.403875
O  -1.744125 -3.811902 -0.544122
N  2.398437 0.990732 0.324904
N  -0.462634 -3.886126 -0.38731
C  0.270307 -0.195613 0.065407
C  1.716102 -0.226592 0.199939
C  -0.491019 1.086394 0.111778
C  -0.418615 -1.415434 -0.142279
C  -1.985887 1.071644 0.252242
C  2.396687 -1.481091 0.189772
C  0.284294 -2.629711 -0.169877
C  1.687389 -2.674497 0.006402
C  -2.804432 1.896379 -0.557444
C  -2.628509 0.332445 1.283674
C  3.766409 1.198045 0.531915
C  -4.193445 1.998183 -0.385416
C  -4.02047 0.42846 1.488758
C  -4.803009 1.259624 0.653198
C  4.170056 2.668379 0.588099
H  -1.499513 -1.429782 -0.300493
H  3.47992 -1.488806 0.318081
H  2.199829 -3.640062 -0.015403
H  1.76885 1.819149 0.200112
H  -2.023975 -0.298516 1.943631
H  -4.772978 2.638874 -1.055909
H  -4.491226 -0.142022 2.294986
H  -5.884677 1.332041 0.804608
H  3.532349 3.264845 1.259472
H  5.229631 2.742186 0.861843
