program: Gaussian 09
title: 000104075
version: EM64L-G09RevD.01
frameworkgroup: C1[X(C9H21BrO3Si)]
method: RPBEPBE
basis: SDD
operation: Freq
keyword: #p
keyword: freq=noraman
keyword: PBEPBE/SDD
title: #p freq=noraman PBEPBE/SDD
converged: YES YES NO NO
title: Mulliken charges:
elementType: Br Si O O O C C C C C C C C C H H H H H H H H H H H H H H H H H H H H H
charge: -0.046938 1.551203 -0.602148 -0.588566 -0.581194 -0.912751 -0.261294 -0.672558 -0.197261 -0.211611 -0.216772 -0.659553 -0.654838 -0.654362 0.256134 0.254114 0.247151 0.237367 0.273814 0.272816 0.208500 0.199571 0.195000 0.200887 0.190858 0.204118 0.223747 0.226120 0.201862 0.230784 0.229225 0.197619 0.229516 0.231297 0.198145
chargesum: 0.00000
title: Mulliken charges with hydrogens summed into heavy atoms:
elementType: Br Si O O O C C C C C C C C C
charge: -0.046938 1.551203 -0.602148 -0.588566 -0.581194 -0.402504 0.223224 -0.125928 0.210810 0.184276 0.178204 -0.007824 0.002789 0.004596
polarizability: 1.80269315e+02 3.40668000e-02 1.39313624e+02 -1.30846974e+01 -3.61210214e-01 1.25381422e+02
1716.lowfreq: -34.0772 -29.6771 -7.9583 -5.7980 -0.0013 -0.0006 -0.0006 7.1284 15.0529
frequency: -33.8377 -27.9512 -6.7194 20.8182 33.1396 40.5281 58.3921 61.6709 65.4844 74.9627 90.2731 107.7906 127.3582 167.3194 199.1558 207.4912 242.4185 244.0302 250.6928 267.0099 276.0999 281.3265 317.7412 368.1696 420.5137 452.0674 569.5522 624.5241 677.9068 703.0128 744.2366 776.5999 793.8971 799.0356 802.4225 809.4730 934.5582 940.6973 945.5102 973.1069 1007.2625 1057.1797 1057.7528 1059.9440 1069.3394 1080.5281 1101.9573 1102.1974 1103.5408 1133.7936 1135.6850 1136.4626 1200.9048 1239.3444 1249.6974 1257.3553 1261.4053 1267.9957 1295.1468 1333.5144 1358.0608 1360.5246 1368.9151 1388.6144 1389.7031 1393.6876 1434.1561 1450.7572 1455.2664 1456.4762 1457.6162 1475.2861 1476.0622 1477.1992 1481.8650 1488.8104 1490.1843 1493.9972 2937.0774 2942.3650 2956.7589 2987.8569 2989.0436 2990.9849 2991.7538 2992.8998 2994.9855 3010.5266 3011.1986 3039.8976 3046.3032 3070.0086 3086.5352 3088.9126 3089.5424 3100.7843 3104.6807 3105.9635 3132.0359
redmass: 2.1887 2.2393 2.9994 5.3907 3.6436 3.8803 2.1137 1.9429 2.1371 3.1807 5.6509 3.0526 3.2648 6.0983 4.5788 2.2122 1.4420 1.2129 1.2827 4.6341 2.8571 2.8345 4.1258 3.6098 4.0389 5.7473 5.1447 5.1757 3.0983 4.9632 1.1861 4.8688 1.4122 1.0924 1.0917 1.0926 2.5789 2.0811 2.5751 1.5508 5.0490 3.7915 3.9867 4.3971 1.0502 5.3100 2.1564 2.1394 2.1460 1.4668 1.4726 1.4741 1.2046 1.3273 1.2570 1.1327 1.1313 1.1265 1.0840 1.3458 1.2486 1.2509 1.2408 1.2571 1.2536 1.2556 1.0823 1.0958 1.0413 1.0408 1.0416 1.0570 1.0502 1.0489 1.0807 1.0773 1.0798 1.0827 1.0570 1.0559 1.0562 1.0586 1.0362 1.0365 1.0456 1.0951 1.1061 1.0604 1.1069 1.0999 1.0563 1.1032 1.0985 1.0985 1.0984 1.1014 1.1014 1.1014 1.1112
irintensity: 0.7271 0.0357 1.4638 0.8995 2.2585 1.1060 2.3768 2.5463 0.8713 1.6778 5.3731 0.7692 4.5599 14.4666 5.8879 0.8608 3.0508 0.2772 1.5949 7.8590 16.0447 15.0127 7.1686 20.6868 7.4099 42.7507 11.4800 12.9526 15.2064 86.0818 32.1330 109.4375 10.4000 2.6406 3.0554 2.4752 87.6466 81.1040 64.2303 118.5305 34.9367 289.2580 247.3522 268.3776 26.1791 53.6282 10.0387 8.0757 5.1584 1.5872 11.0172 6.3747 17.6247 6.2764 92.0645 1.4430 1.1850 1.3702 0.2193 3.9560 10.1599 17.7724 7.0290 25.2494 31.6121 30.6453 15.8902 8.6262 9.5611 11.5251 10.6907 1.0603 8.8363 3.4819 16.0537 7.7540 2.1628 0.1424 56.3848 60.2044 52.2477 9.8881 33.1007 28.3455 21.0517 36.4600 58.8878 10.9666 35.3998 3.9617 22.4215 18.4937 37.6235 40.2149 30.2692 41.7190 32.9616 38.9301 15.5793
temp: 298.150 k
press: 1.00000 atm
elementType: 35 14 8 8 8 6 6 6 6 6 6 6 6 6 1 1 1 1 1 1 1 1 1 1 1 1 1 1 1 1 1 1 1 1 1
symmnumber: 1
zpe: 766730.3 jmol-1
zpe.correction: 0.292032 hartree
zpe.thermalcorrener: 0.310483 hartree
zpe.thermalcorrenthalpy: 0.311427 hartree
zpe.thermalcorrgfe: 0.241446 hartree
zpe.sumelectzpe: -882.973382 hartree
zpe.sumelectthermal: -882.954931 hartree
zpe.sumelectthermalent: -882.953987 hartree
zpe.sumelectthermalfe: -883.023968 hartree
dipole: 2.9586 0.2359 -2.2654
dipole: 3.7337
quadrupole: -110.3866 -92.0440 -108.1671
quadrupole: -1.2658 0.0067 0.1435
quadrupole: -6.8540 11.4886 -4.6345 -1.2658 0.0067 0.1435
hfenergy: -883.265414 hartree
pointgroup: C01 [X(C9H21Br1O3Si1)]
dipole: 1.2085049 0.0083865 0.835021 debye
polarizability: 181.1759815|3.143147|139.5323592|10.3713342|0.1276814|124.2560202 unknown
InChI: InChI=1S/C9H21BrO3Si/c1-4-11-14(12-5-2,13-6-3)9-7-8-10/h4-9H2,1-3H3
charge 0 multiplicity 1
35 atoms
Br -5.370627 -0.274831 0.484257
Si 0.440347 0.035017 0.104257
O  1.790858 0.179862 1.165597
O  0.329178 1.355175 -0.98985
O  0.589884 -1.294668 -0.975886
C  -1.066309 -0.097714 1.251109
C  -2.41232 -0.155168 0.476179
C  -3.5834 -0.188788 1.460788
C  3.208837 0.213296 0.768722
C  0.5030 2.775126 -0.657484
C  0.467274 -2.713391 -0.614459
C  4.057653 0.09865 2.034755
C  0.496819 3.563771 -1.967231
C  0.467502 -3.526101 -1.909426
H  -1.04738 0.776458 1.93197
H  -0.944179 -0.993122 1.892141
H  -2.506996 0.721507 -0.19068
H  -2.445535 -1.049377 -0.173624
H  -3.647069 0.723007 2.075565
H  -3.575391 -1.08345 2.103439
H  3.4220 -0.619899 0.068498
H  3.419198 1.165033 0.238733
H  -0.324405 3.111176 0.003292
H  1.457041 2.925439 -0.110048
H  -0.473196 -2.88666 -0.047247
H  1.317063 -3.009858 0.035018
H  3.851139 -0.85335 2.553606
H  3.827407 0.926334 2.727537
H  5.134212 0.137878 1.783343
H  -0.452591 3.401827 -2.50558
H  1.322477 3.230262 -2.618676
H  0.612745 4.646013 -1.769389
H  1.400932 -3.348248 -2.47014
H  -0.380275 -3.227848 -2.549367
H  0.385404 -4.607158 -1.689517
