program: Gaussian 09
title: 000104069
version: EM64L-G09RevD.01
frameworkgroup: C1[X(C14H22O)]
method: RPBEPBE
basis: SDD
operation: Freq
keyword: #pfreq=noraman
keyword: PBEPBE/SDD
title: #p freq=noraman PBEPBE/SDD
converged: YES YES NO NO
title: Mulliken charges:
elementType: O C C C C C C C C C C C C C C H H H H H H H H H H H H H H H H H H H H H H
charge: -0.480629 0.367020 -0.130300 -0.110159 -0.664131 -0.743063 -0.716021 -0.729688 -0.720804 0.465592 -0.407937 -0.450598 -0.239464 -0.231040 -0.240799 0.217972 0.213780 0.221362 0.225826 0.221163 0.238950 0.215010 0.198985 0.197000 0.262420 0.211515 0.214822 0.213983 0.246614 0.207017 0.202465 0.341987 0.230135 0.269483 0.225191 0.227124 0.229217
chargesum: 0.00000
title: Mulliken charges with hydrogens summed into heavy atoms:
elementType: O C C C C C C C C C C C C C C
charge: -0.138642 0.367020 0.087672 0.103621 -0.216944 -0.067940 -0.057616 -0.089367 -0.064708 0.465592 -0.177802 -0.181115 -0.014274 -0.003917 -0.011581
polarizability: 1.87950635e+02 5.28903721e+00 1.47354034e+02 1.07986072e+01 -1.21198139e+01 1.18970041e+02
1716.lowfreq: -16.8615 -9.8044 -6.2212 -0.0007 -0.0006 -0.0003 37.2655 47.1225 64.8487
frequency: 37.0265 46.5476 64.7312 77.8395 105.2401 170.6074 189.4114 202.4097 205.8449 229.6143 238.6278 250.4321 268.3344 307.9779 315.4874 354.6148 382.9803 385.3357 403.2868 415.8753 429.7212 463.0428 481.4099 514.6276 543.5336 605.6083 618.1447 657.5362 708.7057 764.2448 806.3588 831.6703 857.6383 871.5646 901.2026 913.1486 916.3240 922.3335 949.5890 951.6043 957.4008 977.7970 989.5337 993.8544 998.9399 1001.4832 1028.3222 1079.5615 1103.6497 1115.3917 1137.4782 1149.0421 1171.7497 1175.3570 1176.9253 1189.8871 1215.0353 1224.5779 1255.4798 1293.8895 1301.7573 1310.0418 1328.3545 1337.0234 1372.7100 1374.9497 1379.7848 1383.5094 1392.3480 1403.7056 1439.3025 1453.4535 1464.6208 1469.6690 1472.7837 1475.0446 1481.3458 1484.5908 1487.2920 1495.9678 1496.9982 1588.4957 1611.3198 2939.0349 2976.3911 2977.8828 2979.3865 2984.8874 2992.3637 3002.6589 3057.3204 3060.7911 3062.0594 3066.8234 3068.9891 3078.1468 3096.4966 3099.0836 3116.5107 3117.6379 3122.8960 3135.6028 3145.2610 3162.5975 3511.0707
redmass: 3.6927 2.5525 3.4166 3.2724 2.5480 2.6630 3.0929 1.1987 1.2103 1.2856 1.2834 3.4564 1.7609 2.5557 3.4549 2.6358 2.0717 1.3859 2.1905 1.9800 2.6899 3.5644 2.9017 3.7151 2.6837 3.8742 6.2214 3.1397 1.7213 1.9558 3.4867 2.7688 1.2483 2.4715 1.8951 1.3556 1.1825 1.3613 1.4450 1.4659 1.7693 1.4199 5.9111 1.4800 2.0787 2.1115 2.2011 1.6278 1.8847 1.9117 2.0499 2.1732 1.0926 1.7958 1.7026 1.1337 2.1320 1.6611 1.4672 1.4234 1.4308 1.4047 1.2814 1.4135 1.2127 1.3000 2.3282 1.9917 1.2287 1.2214 2.1477 1.0855 1.0494 1.0512 1.0528 1.0794 1.6639 1.2284 1.0485 1.0517 1.0600 5.9178 6.0956 1.0824 1.0363 1.0387 1.0367 1.0394 1.0802 1.0599 1.1000 1.0992 1.1001 1.0983 1.0981 1.0992 1.0984 1.0966 1.0972 1.0858 1.0866 1.0918 1.0961 1.1015 1.0652
irintensity: 0.2069 0.1017 0.1172 0.1670 0.5458 0.1875 0.0320 0.0550 0.3429 0.4152 0.1172 1.0249 0.3889 0.7927 4.8846 25.3737 1.0150 114.9746 2.5045 56.8226 13.5626 5.7885 1.8297 13.0003 11.2583 2.3834 0.3486 14.3247 50.6400 25.2583 1.5238 2.8241 0.7123 10.3082 3.5977 1.3720 1.1308 1.8942 3.9544 8.5984 23.2334 1.2779 0.3992 7.1077 14.2705 29.3606 8.6004 25.0502 3.4967 3.9495 2.6481 13.4145 0.7156 7.5577 9.3313 0.4308 0.1205 1.9041 16.7334 18.3834 0.9158 9.5869 1.9147 7.2197 5.6157 4.4941 20.4184 20.7278 28.7538 26.7194 7.3887 3.1883 2.5599 14.0042 4.4783 5.0914 6.3487 21.7908 14.7697 12.0968 15.1728 1.5395 8.6783 24.0664 26.5207 29.5707 28.6676 32.1493 26.3142 29.5028 9.2586 7.5183 36.7787 76.0910 75.0747 65.9927 11.0734 32.5107 15.8038 7.3691 0.2772 16.8470 37.1782 22.6408 5.7338
temp: 298.150 k
press: 1.00000 atm
elementType: 8 6 6 6 6 6 6 6 6 6 6 6 6 6 6 1 1 1 1 1 1 1 1 1 1 1 1 1 1 1 1 1 1 1 1 1 1
symmnumber: 1
zpe: 851469.3 jmol-1
zpe.correction: 0.324308 hartree
zpe.thermalcorrener: 0.340879 hartree
zpe.thermalcorrenthalpy: 0.341823 hartree
zpe.thermalcorrgfe: 0.280949 hartree
zpe.sumelectzpe: -620.732084 hartree
zpe.sumelectthermal: -620.715513 hartree
zpe.sumelectthermalent: -620.714569 hartree
zpe.sumelectthermalfe: -620.775443 hartree
dipole: 0.7755 1.1909 -0.7496
dipole: 1.6067
quadrupole: -88.5487 -91.6851 -96.3984
quadrupole: -0.4856 4.7848 -1.0069
quadrupole: 3.6621 0.5256 -4.1877 -0.4856 4.7848 -1.0069
hfenergy: -621.0563918 hartree
pointgroup: C01 [X(C14H22O1)]
dipole: 0.3215788 -0.466855 0.2796651 debye
polarizability: 187.4816304|-4.7283201|147.5058393|-12.5624127|-11.7972056|119.2872397 unknown
InChI: InChI=1S/C14H22O/c1-11(2)14(15,12(3)4)10-13-8-6-5-7-9-13/h5-9,11-12,15H,10H2,1-4H3
charge 0 multiplicity 1
37 atoms
O  -0.926454 0.860292 -1.402338
C  -1.261009 0.093634 -0.168338
C  -2.694608 0.598146 0.229085
C  -1.183191 -1.431852 -0.565801
C  -0.207283 0.466632 0.940298
C  -3.094844 0.278594 1.693798
C  -2.877696 2.117566 -0.017897
C  -1.45347 -2.45825 0.563638
C  -2.075296 -1.76811 -1.787458
C  1.245829 0.318705 0.513483
C  1.996254 -0.845395 0.829435
C  1.891004 1.353596 -0.218986
C  3.342862 -0.977971 0.422957
C  3.237902 1.223581 -0.629473
C  3.968679 0.055437 -0.312798
H  -3.405972 0.07632 -0.441153
H  -0.127198 -1.581062 -0.883511
H  -0.396505 1.519831 1.219865
H  -0.397946 -0.146771 1.838148
H  -2.50524 0.881518 2.409159
H  -2.973784 -0.783181 1.963287
H  -4.157763 0.5427 1.846272
H  -3.912833 2.413503 0.238104
H  -2.193969 2.717145 0.613069
H  -2.67992 2.376181 -1.06882
H  -0.88447 -2.248168 1.486979
H  -2.526537 -2.501914 0.822613
H  -1.162092 -3.468004 0.218255
H  -1.953239 -1.016422 -2.585163
H  -1.8050 -2.76133 -2.192219
H  -3.145819 -1.806427 -1.511036
H  -0.009877 0.597069 -1.681479
H  1.523833 -1.649524 1.407103
H  1.336914 2.272306 -0.444623
H  3.904483 -1.882486 0.683293
H  3.717375 2.035183 -1.188796
H  5.013881 -0.044669 -0.626155
