program: Gaussian 09
title: 000104059
version: EM64L-G09RevD.01
frameworkgroup: C1[X(C9H13N3O)]
method: RPBEPBE
basis: SDD
operation: Freq
keyword: #p
keyword: freq=noraman
keyword: PBEPBE/SDD
title: #p freq=noraman PBEPBE/SDD
converged: YES YES NO NO
title: Mulliken charges:
elementType: O N N N C C C C C C C C C H H H H H H H H H H H H H
charge: -0.248862 -0.164304 -0.090386 -0.695715 -0.357724 -0.350412 -0.315228 -0.306914 0.233748 -0.291169 -0.321284 0.437467 -0.501126 0.268664 0.207732 0.215495 0.202394 0.215198 0.193876 0.189500 0.215413 0.215489 0.220180 0.224894 0.302502 0.300572
chargesum: 0.00000
title: Mulliken charges with hydrogens summed into heavy atoms:
elementType: O N N N C C C C C C C C C
charge: -0.248862 -0.164304 -0.090386 -0.092641 0.118672 0.067478 0.093846 0.097999 0.233748 -0.075679 -0.101104 0.437467 -0.276232
polarizability: 1.90823954e+02 2.82177000e+00 1.19569080e+02 3.92036038e+00 9.21988481e-01 6.84721954e+01
1716.lowfreq: -10.9211 -0.0004 -0.0003 0.0006 8.5636 9.4935 41.1922 51.0900 111.8185
frequency: 40.5843 50.9264 111.8040 154.1475 223.4523 237.9104 260.9875 283.3260 314.7266 335.4712 356.4184 381.2988 414.9499 456.7088 467.6567 490.6938 511.5035 589.2460 639.4489 692.0523 741.1169 796.5245 801.2276 813.7674 838.1260 880.3047 910.2844 925.0413 928.2602 983.1353 1020.3389 1021.6276 1045.8254 1052.9897 1079.4107 1104.7266 1151.4359 1181.5478 1194.2565 1233.4268 1250.9295 1281.0381 1297.2958 1310.2840 1324.7392 1338.5160 1350.4901 1360.3138 1370.9600 1384.0429 1410.5285 1444.2686 1450.5977 1454.4801 1465.2589 1491.2219 1552.1750 1624.4696 1640.7264 2911.3047 2924.9246 2946.9578 2957.8715 3053.3029 3077.8531 3083.5571 3085.3070 3096.4178 3123.6304 3166.3138 3572.4470 3711.6090
redmass: 4.1265 3.7086 4.3750 4.4100 1.8622 2.8535 1.1902 6.1676 1.0668 3.0200 4.0072 2.1254 3.5506 2.7712 3.9569 5.0620 2.4652 2.4707 6.3332 3.3742 4.7753 1.6079 4.1517 6.5398 1.6592 1.4716 2.3787 1.3784 3.6585 2.8555 2.0151 1.6719 2.1243 2.0331 3.9745 2.1757 1.3549 2.5864 1.0784 1.5082 1.3608 1.1983 2.1569 1.8891 1.4176 1.6324 1.6753 1.3934 1.3866 3.1069 2.9730 1.0853 1.1086 1.0927 1.1096 3.4858 5.3367 2.2744 1.7208 1.0698 1.0707 1.0669 1.0667 1.0907 1.0960 1.0907 1.0973 1.0907 1.0897 1.0939 1.0446 1.1042
irintensity: 0.0119 0.8692 6.2621 1.7957 3.0038 12.9771 289.1400 1.5108 56.8360 3.9972 3.7900 0.3968 4.6242 1.8130 4.3045 8.1102 8.5221 7.8186 2.7795 11.2914 3.3791 52.3771 18.2966 11.8566 0.8899 14.7752 8.0759 1.8487 89.7935 2.7889 8.1880 11.7101 12.1333 17.3133 43.7305 6.8368 1.8246 4.7210 7.7904 170.1627 53.2532 8.7203 26.8674 62.8353 11.5869 11.9140 22.4126 17.9171 1.2333 5.8440 53.5749 2.7341 54.8185 10.8495 56.7124 425.6258 131.3257 58.0186 94.7231 71.5374 79.8959 54.1840 100.7455 30.9268 46.3379 11.9102 46.7288 48.6029 28.3887 17.3000 69.4926 19.5735
temp: 298.150 k
press: 1.00000 atm
elementType: 8 7 7 7 6 6 6 6 6 6 6 6 6 1 1 1 1 1 1 1 1 1 1 1 1 1
symmnumber: 1
zpe: 563623.7 jmol-1
zpe.correction: 0.214673 hartree
zpe.thermalcorrener: 0.226657 hartree
zpe.thermalcorrenthalpy: 0.227602 hartree
zpe.thermalcorrgfe: 0.176373 hartree
zpe.sumelectzpe: -589.230247 hartree
zpe.sumelectthermal: -589.218263 hartree
zpe.sumelectthermalent: -589.217319 hartree
zpe.sumelectthermalfe: -589.268547 hartree
dipole: -3.5066 1.6930 -0.2696
dipole: 3.9033
quadrupole: -66.5144 -68.6876 -81.0389
quadrupole: 0.4851 -1.1314 0.1639
quadrupole: 5.5659 3.3927 -8.9586 0.4851 -1.1314 0.1639
hfenergy: -589.4449202 hartree
pointgroup: C01 [X(C9H13N3O1)]
dipole: -1.38155 -0.6700733 0.0238035 debye
dipolederiv: -0.6176966 0.0161051 -0.0637253 0.0273987 -0.7762531 -0.0268026 -0.0729095 -0.0321226 -0.4294063 -1.9456258 0.0175012 0.0658098 -0.0356937 -0.3954116 -0.0048946 -0.4676542 0.0137585 -0.3549713 -0.6929568 -0.3098204 -0.0454432 0.4354527 -0.2226496 -0.0070229 0.0379248 0.020558 -0.228007 -1.7301525 0.0964262 0.0699424 0.081306 -0.0766741 0.1166764 0.065339 0.1160755 -0.7512829 0.1242216 0.2462229 -0.0608812 0.5274682 0.2863648 -0.1225173 0.0353517 -0.1311689 0.2976171 0.2456631 -0.2390528 -0.1306318 -0.5050677 0.2794254 0.0940034 -0.1669754 0.1123603 0.3613077 0.4246338 -0.1916832 -0.0156974 -0.1390047 0.5136462 0.0593802 0.0753744 0.1206334 0.3818883 0.3924761 0.1722686 0.0172743 0.1132682 0.5600868 -0.0323658 0.1053499 -0.0930958 0.3648784 2.0617449 -0.0163463 -0.0435846 0.0791277 -0.2237768 -0.0515981 0.0968646 -0.0556537 0.0854363 -0.4219215 0.2529289 0.0437073 -0.478497 0.0459698 0.0708371 -0.0592802 0.0308947 -0.1603361 0.010444 -0.2271606 -0.0411478 0.3033395 0.2131981 0.0580384 0.0582564 0.0851993 -0.1755704 1.6177063 -0.1556785 -0.1093206 0.0480859 -0.392049 -0.0973773 -0.0670048 -0.0827294 0.1240996 0.0175586 0.321168 0.0592123 -0.5181818 0.3819354 0.1156744 -0.0787329 0.0737802 -0.134954 0.1814144 0.1068991 0.0259782 0.0224236 0.0067841 -0.0302485 0.0037528 -0.0397602 0.0710106 -0.0412945 -0.0666574 0.0156155 -0.1613317 0.0145499 0.0119986 0.1105371 0.1185022 -0.2010164 -0.0499888 0.0487495 0.0140891 0.130413 0.0207349 0.0120898 0.1482838 -0.0969252 -0.2229938 0.0529993 -0.1325527 0.026158 -0.0467354 -0.0989978 0.0341232 0.0358055 0.0405362 0.0554017 -0.0563361 -0.0986754 0.0120469 -0.096195 -0.1168549 0.0110165 0.0531834 0.0535071 0.0838778 0.0441547 0.0696641 0.0411406 0.0569582 0.01954 0.0608512 -0.0113558 -0.0573765 -0.2153618 0.046375 -0.0763043 0.0353477 -0.0488167 0.0018019 -0.0108474 -0.0246105 0.1049778 -0.2121883 -0.067676 0.0960295 0.029799 0.0931495 -0.0936339 -0.0434053 0.0730129 -0.0846821 0.0640089 0.0609514 0.0947877 0.0270903 0.106643 -0.0602636 -0.0472706 0.0223323 -0.0496887 0.1474727 -0.0216223 -0.1103252 -0.0135596 -0.1129432 -0.0447554 -0.0326846 -0.0166828 -0.0329121 0.1511519 -0.03184 0.1077586 0.0259358 0.1355546 -0.0814859 -0.0425955 0.035698 -0.040511 0.1280874 0.2049259 -0.0248783 0.0049061 -0.0411951 0.1223999 -0.0447519 -0.0003693 -0.0443518 0.3862976 0.1918418 0.0026256 0.0099383 0.0230732 0.1163686 -0.0503068 0.0085086 -0.0498049 0.3835523 unknown
polarizability: 190.741324|-2.4236892|118.3732558|-5.1251488|7.8560467|69.7506499 unknown
InChI: InChI=1S/C9H13N3O/c10-8-1-2-9(11-7-8)12-3-5-13-6-4-12/h1-2,7H,3-6,10H2
charge 0 multiplicity 1
26 atoms
O  3.956999 0.06925 -0.042487
N  1.073197 -0.057636 -0.014778
N  -0.966417 1.119135 0.210157
N  -4.556823 0.129205 0.213746
C  1.770859 1.233425 -0.212271
C  1.860679 -1.236169 -0.413077
C  3.149366 1.199699 0.459089
C  3.255757 -1.18812 0.245203
C  -0.337743 -0.077434 -0.015195
C  -1.104542 -1.26807 -0.208674
C  -2.507049 -1.208826 -0.130065
C  -3.163412 0.028596 0.126525
C  -2.3203 1.164322 0.2784
H  1.136116 2.02777 0.211528
H  1.898485 1.437716 -1.299645
H  1.97311 -1.28873 -1.52079
H  1.361243 -2.16095 -0.075401
H  3.730405 2.104663 0.217134
H  3.033694 1.110999 1.561064
H  3.145862 -1.311484 1.345233
H  3.901539 -1.987875 -0.154332
H  -0.629171 -2.227035 -0.429659
H  -3.095502 -2.122593 -0.278792
H  -2.757198 2.156108 0.459248
H  -5.001167 1.02487 0.389462
H  -5.148188 -0.687236 0.096177
