program: Gaussian 09
title: 000104058
version: EM64L-G09RevD.01
frameworkgroup: C1[X(C8H9NO3)]
method: RPBEPBE
basis: SDD
operation: Freq
keyword: #pfreq=noraman
keyword: PBEPBE/SDD
title: #p freq=noraman PBEPBE/SDD
converged: YES YES NO NO
title: Mulliken charges:
elementType: O O O N C C C C C C C C H H H H H H H H H
charge: -0.420498 -0.208069 -0.208263 0.019108 0.568568 -0.602581 -0.501734 -0.313607 -0.406747 0.379096 -0.185813 -0.372862 0.224841 0.211706 0.282917 0.202631 0.230189 0.239107 0.237733 0.287561 0.336718
chargesum: 0.00000
title: Mulliken charges with hydrogens summed into heavy atoms:
elementType: O O O N C C C C C C C C
charge: -0.083779 -0.208069 -0.208263 0.019108 0.568568 -0.166035 -0.218816 0.119213 -0.167641 0.379096 0.051919 -0.085302
polarizability: 1.39751515e+02 5.71254575e+00 1.18051345e+02 1.21784805e+01 -1.17097886e+01 5.88165952e+01
1716.lowfreq: -5.7389 -0.0009 -0.0008 -0.0006 3.6284 10.0391 33.6536 54.1972 79.6609
frequency: 32.8856 54.1948 79.6578 141.4126 170.6219 201.4243 259.9637 314.4323 343.1303 388.0397 421.0512 437.0805 482.0682 526.5026 581.5902 655.7687 691.7592 705.6006 742.5275 815.7788 842.6754 852.6494 921.0191 949.0229 977.0515 982.6553 990.1826 998.0942 1039.0862 1079.5921 1089.8043 1122.1648 1176.5212 1208.5991 1221.0360 1231.4069 1296.3708 1317.8709 1335.2986 1372.0075 1377.6982 1399.7914 1435.7644 1463.6579 1467.0774 1481.4665 1590.4774 1618.1324 2960.9215 2985.5392 3039.9268 3083.8229 3126.9310 3157.3154 3179.2427 3188.1539 3559.6955
redmass: 5.0887 11.6936 5.7537 2.6926 4.7046 5.2489 3.3353 1.3553 2.6003 5.8953 2.8951 3.0213 4.7856 6.1349 3.5797 7.4646 2.0654 5.9145 7.0896 1.4927 2.4465 4.3237 1.4836 1.4108 2.1455 2.0382 5.9463 1.3555 3.0359 1.4663 2.0870 1.1282 1.1319 3.2245 1.5857 2.4207 1.3066 1.3848 1.2809 7.9625 1.2859 6.2303 2.7421 1.1050 1.1327 2.5882 6.5537 7.0611 1.0671 1.0613 1.1012 1.0970 1.0893 1.0933 1.0922 1.0962 1.0663
irintensity: 1.2609 0.1480 0.9823 4.8625 7.6017 2.6889 14.5798 131.6018 54.1301 1.4209 4.7522 7.4592 1.2118 1.8378 12.6197 7.3680 33.5844 11.1400 21.0652 37.9557 8.0731 6.3118 4.2104 4.7627 11.4924 46.3824 0.9320 0.5579 24.2079 48.7305 14.0400 10.7686 8.9391 101.1499 97.1007 83.2007 0.7154 4.8604 10.0317 102.5006 28.1840 2.0971 13.8032 10.4697 5.1189 35.9074 3.4225 4.9210 70.6498 56.3015 16.7841 26.7720 9.4519 14.0032 2.1379 4.4491 6.3506
temp: 298.150 k
press: 1.00000 atm
elementType: 8 8 8 7 6 6 6 6 6 6 6 6 1 1 1 1 1 1 1 1 1
symmnumber: 1
zpe: 419675.2 jmol-1
zpe.correction: 0.159846 hartree
zpe.thermalcorrener: 0.170885 hartree
zpe.thermalcorrenthalpy: 0.171829 hartree
zpe.thermalcorrgfe: 0.121647 hartree
zpe.sumelectzpe: -589.692477 hartree
zpe.sumelectthermal: -589.681438 hartree
zpe.sumelectthermalent: -589.680494 hartree
zpe.sumelectthermalfe: -589.730676 hartree
dipole: 5.3666 3.2244 1.8320
dipole: 6.5233
quadrupole: -73.7010 -65.2760 -73.2404
quadrupole: -6.6474 5.7832 -4.9231
quadrupole: -2.9618 5.4631 -2.5012 -6.6474 5.7832 -4.9231
hfenergy: -589.8523233 hartree
pointgroup: C01 [X(C8H9N1O3)]
dipole: 2.1560372 1.1707958 0.7533398 debye
dipolederiv: -0.5855188 0.0105946 0.0532218 0.082839 -0.6522411 -0.3190116 0.1910052 -0.3288831 -0.3000059 -0.8956845 0.0341471 -0.1506409 -0.0071073 -0.4606653 0.0656205 -0.1498393 0.0699097 -0.283254 -0.511258 -0.0942347 -0.0364977 -0.1072822 -0.8074426 0.1456246 -0.0379167 0.1398498 -0.2763357 1.4951231 0.3082669 0.2021476 0.3979713 1.2076055 -0.2107825 0.1977744 -0.1998835 0.2930367 0.3652174 -0.2545831 0.0732879 -0.2085374 -0.1541506 -0.009658 0.1152811 -0.0483356 -0.0690942 -0.0964805 0.1238739 0.0819616 0.1290461 0.0100156 -0.051358 0.2209408 -0.1680517 0.0009691 -0.017061 0.2349223 -0.0354407 -0.1272335 0.0142213 -0.0253992 -0.0003218 0.0800252 -0.0966893 0.4178063 0.0357919 -0.0097749 -0.0127848 0.5874403 0.1712568 -0.1960038 0.2387397 0.3366975 0.0322742 0.0857513 0.0363172 0.1240657 0.0450119 -0.0313942 0.0027467 -0.0277132 -0.1151413 -0.3591819 -0.296615 -0.0082924 -0.3315593 -0.155397 -0.0180949 -0.0099381 -0.0080122 0.0728792 -0.2271197 -0.0409126 -0.0116004 -0.0366483 0.157321 -0.0761361 -0.0056555 -0.0794111 -0.113136 -0.0146931 -0.0226448 0.0435151 0.2367143 -0.000372 0.0231727 -0.0368369 -0.0389449 -0.1173622 0.0224399 -0.0038562 0.0384431 0.0390723 -0.0397374 0.1401064 -0.0223419 0.08871 -0.0228076 -0.0275763 -0.0342827 -0.0519652 -0.1095229 -0.0608116 -0.1020622 -0.0471666 -0.0448258 0.0516945 0.1372323 0.0120169 -0.0181138 0.0428585 0.0308292 0.0409315 -0.0088421 0.0241941 0.1375588 -0.2759643 0.038523 -0.0639835 0.0930138 -0.0094191 -0.0209095 -0.0690718 -0.0477105 0.0254727 0.1063349 -0.0022339 -0.0103503 -0.0505836 -0.0434869 0.0753208 0.0138768 0.0703588 -0.0451226 -0.0391096 -0.1080932 -0.0217252 -0.0914898 0.0469344 0.008907 -0.0274147 0.0014705 0.1340106 0.07713 0.0118654 -0.0194345 0.009913 -0.0874224 0.0578479 -0.0208874 0.0604269 0.1360641 0.0506046 0.0448946 -0.0388459 0.0135295 0.1237337 0.0155713 -0.031773 0.0232529 0.1624903 0.3454851 -0.0831919 -0.0522291 -0.0862745 0.2480328 0.1204468 -0.0776153 0.1948341 0.0880753 unknown
polarizability: 139.8675068|4.8725551|117.5984915|12.8231517|-12.1310974|59.1534561 unknown
InChI: InChI=1S/C8H9NO3/c10-5-4-7-2-1-3-8(6-7)9(11)12/h1-3,6,10H,4-5H2
charge 0 multiplicity 1
21 atoms
O  2.648044 -1.883566 -0.893848
O  -3.500513 -0.291274 -0.406117
O  -2.20964 -2.004638 0.363405
N  -2.372997 -0.778729 -0.008182
C  1.178888 0.450083 0.483173
C  2.54269 -0.091192 0.871694
C  0.047784 -0.397198 0.439971
C  3.31374 -0.704578 -0.32888
C  1.019288 1.811671 0.111972
C  -1.194718 0.12639 0.027059
C  -0.234434 2.318996 -0.301081
C  -1.362893 1.476077 -0.349566
H  2.444804 -0.862673 1.660918
H  3.165989 0.72196 1.292002
H  0.112377 -1.452491 0.716549
H  4.350965 -0.946338 -0.013113
H  3.358426 0.012984 -1.164639
H  1.886769 2.482053 0.148396
H  -0.33216 3.372893 -0.580816
H  -2.347151 1.834064 -0.661564
H  2.649441 -2.612994 -0.223331
