program: Gaussian 09
title: 000104094
version: EM64L-G09RevD.01
frameworkgroup: C1[X(C18H23N3O5)]
method: RPBEPBE
basis: SDD
operation: Freq
keyword: #p
keyword: freq=noraman
keyword: PBEPBE/SDD
title: #p freq=noraman PBEPBE/SDD
converged: YES YES NO NO
title: Mulliken charges:
elementType: O O O O O N N N C C C C C C C C C C C C C C C C C C H H H H H H H H H H H H H H H H H H H H H H H
charge: -0.460830 -0.461347 -0.296003 -0.281247 -0.464884 -0.133709 -0.449874 -0.361631 0.453724 -0.441195 -0.440961 -0.380010 -0.342577 0.475789 -0.300240 -0.299898 -0.357165 -0.487067 0.330001 0.381116 0.012315 -0.427157 0.006572 -0.501073 -0.336084 -0.330491 0.210156 0.294468 0.212755 0.294258 0.226992 0.227969 0.196161 0.216027 0.196883 0.215316 0.235196 0.235255 0.344785 0.245383 0.251082 0.361164 0.244410 0.213479 0.349864 0.349950 0.210184 0.203092 0.359099
chargesum: 0.00000
title: Mulliken charges with hydrogens summed into heavy atoms:
elementType: O O O O O N N N C C C C C C C C C C C C C C C C C C
charge: -0.110967 -0.111397 -0.296003 -0.281247 -0.105785 -0.133709 -0.105089 -0.000467 0.453724 0.063428 0.066053 -0.153018 -0.114608 0.475789 0.111948 0.112301 -0.121969 -0.251812 0.330001 0.381116 0.012315 -0.181774 0.006572 -0.249992 0.121804 0.082785
polarizability: 6.25878843e+02 2.83241418e+01 2.41814649e+02 -7.39577472e+00 -1.83304582e+01 1.43548499e+02
1716.lowfreq: -8.2430 -1.9158 -0.0012 -0.0009 0.0014 4.6444 13.0212 21.3155 29.3231
frequency: 10.3366 20.7350 29.3118 37.7047 47.7074 49.0544 75.3203 79.5585 86.4317 99.5237 104.8394 119.9891 123.4042 137.2977 151.1100 169.1629 190.4904 202.2353 235.5552 237.7615 251.3677 260.3902 266.0839 272.2345 294.8192 345.6695 364.5031 371.0891 390.3499 419.4156 433.2633 440.2535 448.2826 455.6217 468.1307 497.1815 508.1701 524.0579 536.3393 559.1534 572.3073 613.8946 634.3186 683.7167 715.1143 718.7839 731.0557 737.1285 746.3504 792.7145 809.1724 817.4702 824.0960 828.8384 832.7691 842.8840 847.0351 848.4297 881.9541 885.0099 902.9901 907.9234 914.4719 931.9364 942.4899 991.7155 994.1065 1026.1797 1031.1353 1035.9341 1054.9959 1058.8117 1087.1037 1105.8893 1140.0117 1159.5499 1171.8530 1187.3355 1200.9464 1202.2672 1208.5164 1209.6045 1216.0827 1227.4414 1235.2333 1237.2684 1254.1515 1273.7888 1277.2519 1289.1549 1309.5089 1315.0241 1336.1322 1343.6962 1350.8773 1364.4257 1369.5549 1376.6902 1391.6658 1396.9385 1402.3341 1405.5482 1446.3669 1458.7890 1469.6015 1470.8070 1474.5810 1477.1072 1486.3599 1493.6859 1503.7602 1526.9204 1539.5423 1555.2102 1587.9937 1613.2623 1635.3258 1637.9081 2941.1941 2941.7347 2958.8165 2969.2947 3001.4480 3002.9880 3014.1231 3015.7582 3018.8366 3044.0570 3081.5638 3087.2333 3122.7975 3157.8647 3158.2832 3166.4452 3186.8033 3200.6361 3243.4690 3393.9307 3578.6453 3578.9658 3591.4174
redmass: 5.3804 5.9599 5.4639 5.8113 4.5180 4.9311 5.6049 5.4886 4.3241 4.1980 3.5321 3.4177 3.9804 4.9743 4.9107 4.9645 5.2278 5.0447 2.2074 1.9064 1.5686 1.7189 4.0851 1.2745 2.5996 3.7560 3.5755 5.6353 2.9433 3.0829 6.2607 4.5835 3.3888 2.3773 4.3144 4.5895 2.7245 2.8359 2.9506 4.3055 3.1574 4.7375 6.6200 4.6502 5.2293 3.8019 4.1776 2.6042 3.9864 1.2668 1.7596 1.1932 1.4961 2.2778 3.2809 2.8946 2.5781 2.4093 1.6307 1.8714 2.2471 2.5187 2.4246 1.3669 1.3500 2.7988 2.3577 3.5141 2.8010 2.8453 1.7405 1.8389 1.9351 2.5667 1.7493 1.3315 2.4501 1.3592 1.2502 1.2584 1.0952 1.1653 1.2602 1.6906 1.5409 1.5889 1.7802 1.3194 1.2280 1.2439 1.7848 3.2826 1.5308 3.1653 1.3075 1.3631 1.5895 4.1112 1.4007 1.4086 2.2748 1.4777 3.3574 1.1012 1.0806 1.0837 1.0827 1.1469 2.3455 1.9632 1.5934 2.6991 4.3064 6.1010 3.1210 9.3642 6.6927 6.2459 1.0571 1.0570 1.0554 1.0654 1.0927 1.0966 1.0765 1.0731 1.1056 1.0986 1.0993 1.0984 1.0895 1.0907 1.0881 1.0928 1.0942 1.0902 1.0740 1.0753 1.0666 1.0666 1.0669
irintensity: 0.2517 1.5346 1.4075 0.5421 2.7305 0.9581 5.1559 1.0614 4.7635 22.7828 2.8177 11.6826 8.4899 4.9202 1.4312 7.4327 1.3055 3.6251 82.1094 103.0432 62.6410 50.6965 17.5535 210.5684 9.2470 77.4102 4.7184 0.5521 13.5148 1.1017 0.1647 10.6380 8.0998 11.9299 7.2799 5.5373 30.3108 30.7356 26.9718 8.5581 6.3161 6.0946 0.6213 0.1125 17.4598 1.4540 0.9545 0.1759 3.6572 1.1638 58.5118 122.5688 11.4030 29.2923 1.9661 27.1460 55.2423 28.7904 79.7320 32.2014 4.3571 58.4745 2.2813 6.4356 4.2693 2.5258 38.3941 58.0677 88.4426 102.9618 0.5026 5.8215 0.0857 19.2057 19.0548 61.9101 15.8134 105.7829 187.1427 1.8894 3.2458 22.3610 13.1651 17.3867 8.8985 29.2807 22.1156 77.3592 47.3881 14.0521 16.4502 255.3270 106.5942 28.6126 3.0165 175.8466 10.7558 13.4624 11.6381 2.6868 139.3622 4.2507 4.0640 150.1623 11.2109 18.4333 22.0187 29.0923 765.2787 51.0740 8.1896 310.0074 64.8626 114.2799 112.2274 685.1888 408.7699 66.0182 109.3249 6.3949 73.9045 38.8351 2.6114 64.4091 102.7200 101.5303 86.0820 25.8727 1.5387 9.6223 8.1220 31.9900 9.7910 33.1261 1.8059 4.1238 84.2309 124.3016 4.6210 3.0817 8.0390
temp: 298.150 k
press: 1.00000 atm
elementType: 8 8 8 8 8 7 7 7 6 6 6 6 6 6 6 6 6 6 6 6 6 6 6 6 6 6 1 1 1 1 1 1 1 1 1 1 1 1 1 1 1 1 1 1 1 1 1 1 1
symmnumber: 1
zpe: 1030876.0 jmol-1
zpe.correction: 0.392640 hartree
zpe.thermalcorrener: 0.419073 hartree
zpe.thermalcorrenthalpy: 0.420018 hartree
zpe.thermalcorrgfe: 0.332641 hartree
zpe.sumelectzpe: -1238.109336 hartree
zpe.sumelectthermal: -1238.082902 hartree
zpe.sumelectthermalent: -1238.081958 hartree
zpe.sumelectthermalfe: -1238.169334 hartree
dipole: 1.5742 0.1370 1.5749
dipole: 2.2310
quadrupole: -88.7074 -156.1390 -145.7195
quadrupole: 0.6872 -12.5820 10.6246
quadrupole: 41.4812 -25.9504 -15.5308 0.6872 -12.5820 10.6246
hfenergy: -1238.5019755 hartree
pointgroup: C01 [X(C18H23N3O5)]
dipole: 0.5911459 0.5705702 -0.308905 debye
polarizability: 624.0576728|-2.1216777|170.1403689|-40.3240436|47.0419077|217.0439495 unknown
InChI: InChI=1S/C18H23N3O5/c22-8-5-19-15-11-18(26)16(12-17(15)25)20-13-1-3-14(4-2-13)21(6-9-23)7-10-24/h1-4,11-12,19-20,22-24H,5-10H2
charge 0 multiplicity 1
49 atoms
O  6.707365 2.307276 -1.303238
O  6.812485 -0.656668 2.10925
O  -2.571115 -2.040511 -2.159222
O  -3.777164 1.455068 1.909989
O  -8.181163 0.942918 1.921741
N  4.884426 0.383584 0.077997
N  -0.577247 -0.847396 -0.997136
N  -5.786023 0.208332 0.708591
C  3.540604 0.082349 -0.164282
C  5.937029 0.058879 -0.899939
C  5.31417 1.057617 1.315259
C  2.525423 0.310398 0.82154
C  3.105569 -0.478602 -1.411669
C  0.753061 -0.508658 -0.671858
C  6.131829 1.1328 -1.982373
C  5.602418 0.098074 2.480721
C  1.172081 0.026748 0.576257
C  1.755119 -0.765458 -1.649701
C  -1.790511 -0.501982 -0.464395
C  -4.549701 -0.117131 0.245923
C  -2.912259 -1.2446 -1.20083
C  -2.079128 0.39426 0.567558
C  -3.435612 0.637632 0.974236
C  -4.264514 -1.014896 -0.786091
C  -7.056935 -0.332116 0.233786
C  -8.178709 0.682287 0.473137
H  5.724686 -0.914038 -1.380941
H  6.884299 -0.063568 -0.349013
H  4.554521 1.797135 1.629529
H  6.232442 1.62509 1.089549
H  2.791411 0.699671 1.807929
H  3.823414 -0.682354 -2.210484
H  6.829686 0.746535 -2.75706
H  5.162791 1.384341 -2.460253
H  5.778208 0.69139 3.404484
H  4.743451 -0.584234 2.646584
H  0.455304 0.181442 1.384781
H  1.461479 -1.184026 -2.620484
H  -0.725599 -1.495883 -1.799032
H  -1.315079 0.97719 1.082912
H  -5.043218 -1.575241 -1.311406
H  -5.796691 0.847563 1.520248
H  -7.301887 -1.277798 0.759917
H  -6.992734 -0.553434 -0.847933
H  6.732139 3.076649 -1.924374
H  6.978702 -1.3725 2.771321
H  -7.975399 1.611519 -0.098617
H  -9.144367 0.249583 0.139893
H  -8.790154 1.691662 2.136397
