program: Gaussian 09
title: 000104036
version: EM64L-G09RevD.01
frameworkgroup: C1[X(C10H12O6)]
method: RPBEPBE
basis: SDD
operation: Freq
keyword: #pfreq=noraman
keyword: PBEPBE/SDD
title: #p freq=noraman PBEPBE/SDD
converged: YES YES NO NO
title: Mulliken charges:
elementType: O O O O O O C C C C C C C C C C H H H H H H H H H H H H
charge: -0.271075 -0.260270 -0.248848 -0.238617 -0.417432 -0.232687 -0.263842 -0.277732 0.173258 0.340382 -0.753544 0.270210 -0.264488 -0.626200 -0.221443 0.181928 0.230157 0.249550 0.232015 0.250556 0.238380 0.245117 0.216294 0.288754 0.230796 0.255431 0.288341 0.385011
chargesum: 0.00000
title: Mulliken charges with hydrogens summed into heavy atoms:
elementType: O O O O O O C C C C C C C C C C
charge: -0.271075 -0.260270 -0.248848 -0.238617 -0.032421 -0.232687 0.215865 0.204838 0.173258 0.340382 -0.053754 0.270210 0.024266 -0.139973 0.066899 0.181928
polarizability: 1.96437310e+02 1.67085436e+00 1.22398815e+02 1.63816996e+01 -5.69352499e+00 9.20527442e+01
1716.lowfreq: -4.6642 -0.8686 -0.0007 -0.0004 0.0002 7.3769 12.7337 16.1839 22.8279
frequency: 12.5838 15.8685 22.8138 47.7327 60.3755 78.4549 93.5432 134.5286 149.2869 161.2375 168.9437 186.9412 215.4968 257.2113 268.0461 287.0474 341.9255 365.3849 393.6221 431.8352 481.9430 509.5423 569.9126 573.6249 580.5818 631.0002 649.4963 707.8125 727.5980 780.6833 785.4012 809.9868 864.5363 919.1752 920.0456 948.0361 963.2920 990.4881 997.3329 1009.7221 1011.3907 1032.9022 1053.4868 1059.3792 1108.2459 1111.7798 1135.6030 1204.2316 1223.3917 1247.4313 1283.9438 1289.1816 1327.3250 1354.5066 1385.5206 1397.1340 1416.0679 1451.5958 1454.3059 1456.8702 1471.5192 1611.4457 1615.8695 1638.4501 1653.4468 1663.6219 2990.8721 3012.5899 3021.5814 3074.3788 3079.1477 3090.0169 3099.7914 3104.7670 3163.4342 3168.5781 3217.1575 3522.1291
redmass: 4.5538 6.1947 6.0695 7.7280 5.0978 6.4038 6.2709 3.5417 5.7844 3.1260 1.0761 5.9721 3.2953 3.8493 5.9147 2.9249 5.1110 2.7678 3.5650 3.6458 3.8805 3.9781 1.7963 5.0985 4.1094 1.5323 1.8100 5.9556 8.6454 2.6362 2.5568 4.2432 4.0650 2.1484 5.3053 2.0001 3.8580 1.3190 2.6565 1.4481 1.0893 2.2577 1.5055 2.2194 3.1364 3.0425 2.9981 1.0945 1.4176 1.0946 1.7590 2.8274 2.2683 1.3891 1.6894 1.1675 1.2476 1.0797 1.0775 1.0450 1.0619 11.2527 10.9702 8.7301 5.2307 6.6651 1.0362 1.0574 1.0606 1.0971 1.1058 1.1052 1.1004 1.0621 1.0976 1.0887 1.1157 1.0642
irintensity: 0.7664 0.0746 0.3117 3.5998 1.3933 1.8727 0.7290 3.1282 4.5179 0.2117 1.7035 5.2980 4.6193 3.5893 3.5611 5.0286 14.6905 2.2229 0.1720 21.1846 1.3640 38.1290 70.9176 33.2357 8.4389 10.1758 80.4487 2.8291 38.9975 6.2055 10.0676 6.7716 7.8187 0.5956 84.6134 5.6166 98.7789 56.7537 14.0562 23.1535 59.3957 32.8917 6.5690 248.5005 411.9659 280.1853 130.6431 5.5136 89.3454 2.3376 256.9836 36.4761 178.8183 9.3420 0.6494 22.6837 10.6978 9.4679 21.8327 16.4937 36.6367 154.1202 197.3275 157.5493 4.7349 1.8140 14.6753 3.0467 24.9759 14.3274 11.0144 21.3524 25.7501 3.6544 0.0913 0.8849 4.9852 54.6565
temp: 298.150 k
press: 1.00000 atm
elementType: 8 8 8 8 8 8 6 6 6 6 6 6 6 6 6 6 1 1 1 1 1 1 1 1 1 1 1 1
symmnumber: 1
zpe: 546192.1 jmol-1
zpe.correction: 0.208034 hartree
zpe.thermalcorrener: 0.225529 hartree
zpe.thermalcorrenthalpy: 0.226473 hartree
zpe.thermalcorrgfe: 0.157909 hartree
zpe.sumelectzpe: -838.370360 hartree
zpe.sumelectthermal: -838.352865 hartree
zpe.sumelectthermalent: -838.351921 hartree
zpe.sumelectthermalfe: -838.420484 hartree
dipole: 0.3099 0.4704 1.2597
dipole: 1.3799
quadrupole: -85.0788 -90.1137 -98.1779
quadrupole: -0.4610 -8.1696 6.5436
quadrupole: 6.0446 1.0098 -7.0545 -0.4610 -8.1696 6.5436
hfenergy: -838.5783938 hartree
pointgroup: C01 [X(C10H12O6)]
dipole: -0.1305636 -0.1841835 0.4937281 debye
polarizability: 196.8776896|0.7583017|122.3577248|-14.933163|5.9240385|91.6534549 unknown
InChI: InChI=1S/C10H12O6/c1-7(2)10(14)16-6-5-15-9(13)4-3-8(11)12/h3-4,11H,1,5-6H2,2H3
charge 0 multiplicity 1
28 atoms
O  2.445159 0.387373 0.161382
O  -0.418565 0.974104 -0.253799
O  4.28116 0.519439 -1.265229
O  -1.988798 2.082665 1.077529
O  -6.116487 -0.815874 0.168156
O  -4.53967 -1.91968 -1.145866
C  1.90949 1.602263 -0.501034
C  0.607651 1.959448 0.184688
C  3.676157 -0.072607 -0.337594
C  4.116746 -1.315752 0.375278
C  3.232707 -1.889074 1.462939
C  -1.696396 1.154898 0.284051
C  -2.609876 0.101997 -0.227297
C  5.303226 -1.862612 -0.009908
C  -3.916709 0.065628 0.151096
C  -4.828879 -0.987362 -0.358809
H  2.642537 2.423502 -0.395651
H  1.766438 1.400448 -1.576995
H  0.273145 2.971821 -0.10812
H  0.696629 1.922678 1.284415
H  3.079156 -1.157916 2.276837
H  2.229973 -2.133811 1.069433
H  3.680335 -2.803032 1.888284
H  -2.198584 -0.643496 -0.916185
H  5.690854 -2.771426 0.462502
H  5.896732 -1.401313 -0.80675
H  -4.328004 0.810597 0.840115
H  -6.715527 -1.529607 -0.182468
