program: Gaussian 09
title: 000104028
version: EM64L-G09RevD.01
frameworkgroup: C1[X(C4H4N2O)]
method: RPBEPBE
basis: SDD
operation: Freq
keyword: #pfreq=noraman
keyword: PBEPBE/SDD
title: #p freq=noraman PBEPBE/SDD
converged: NO NO NO NO
title: Mulliken charges:
elementType: O N N C C C C H H H H
charge: -0.166281 0.021595 -0.011403 -0.524733 0.071861 -0.180472 -0.291003 0.285511 0.285238 0.251756 0.257931
chargesum: 0.00000
title: Mulliken charges with hydrogens summed into heavy atoms:
elementType: O N N C C C C
charge: -0.166281 0.021595 -0.011403 0.046016 0.071861 0.071284 -0.033072
polarizability: 7.22274489e+01 1.47946557e+00 6.20188897e+01 -9.56735908e-03 4.08984202e-04 2.95071447e+01
1716.lowfreq: -77.0635 -18.0928 -12.8571 -0.0011 -0.0007 -0.0006 11.6702 226.0229 413.3119
frequency: -76.8718 226.0225 413.3114 444.0864 508.4475 532.4202 605.1056 732.1661 772.8699 860.8315 922.7314 945.4082 996.8904 997.5025 1117.5826 1147.2034 1286.7182 1356.2551 1374.0763 1381.9959 1471.9867 1587.8336 1627.1163 2981.3239 3023.3645 3096.7400 3148.4871
redmass: 3.1394 2.9211 2.3696 8.3262 9.5935 2.2646 7.8581 6.4247 1.2940 7.7921 2.6870 2.3059 1.7216 5.1428 4.6221 1.2008 1.8996 1.2715 1.1605 1.1284 8.5335 6.3158 12.3690 1.0622 1.0956 1.0918 1.0929
irintensity: 12.2674 1.5289 1.5064 3.3677 0.1102 0.0393 2.9753 3.0985 16.7572 16.3699 0.8553 38.9148 4.1943 19.7468 67.5310 7.3240 12.8382 40.1138 41.9764 27.7462 179.6358 93.5809 167.8660 1.1548 0.0278 21.1715 19.1048
temp: 298.150 k
press: 1.00000 atm
elementType: 8 7 7 6 6 6 6 1 1 1 1
symmnumber: 1
zpe: 200724.3 jmol-1
zpe.correction: 0.076452 hartree
zpe.thermalcorrener: 0.081459 hartree
zpe.thermalcorrenthalpy: 0.082403 hartree
zpe.thermalcorrgfe: 0.047668 hartree
zpe.sumelectzpe: -338.994441 hartree
zpe.sumelectthermal: -338.989434 hartree
zpe.sumelectthermalent: -338.988490 hartree
zpe.sumelectthermalfe: -339.023225 hartree
dipole: -2.6457 3.3857 0.0242
dipole: 4.2969
quadrupole: -53.3127 -35.6887 -38.7527
quadrupole: 2.5865 0.0107 0.0105
quadrupole: -10.7280 6.8960 3.8320 2.5865 0.0107 0.0105
hfenergy: -339.0708929 hartree
pointgroup: C01 [X(C4H4N2O1)]
dipole: 1.0666614 1.3115171 -0.0101333 debye
dipolederiv: -1.0134078 -0.0169709 0.0015839 0.0904616 -0.4053656 0.0000283 0.0041641 -0.0001171 -0.3350921 -1.027896 0.0270479 0.0009752 0.3816175 -0.5232302 -0.0000767 0.0035293 -0.0001676 -0.2326661 -0.3545397 0.0673684 -0.0003925 -0.2307009 -0.990726 -0.0003372 0.0022095 -0.0019073 -0.1389961 -0.3369073 0.0942067 -0.0012481 -0.1039504 -0.4906308 0.0019031 -0.0004148 0.0034226 0.1474345 1.367918 -0.0073457 -0.0049494 -0.3492603 0.7755999 -0.0011399 -0.0066477 -0.0012605 0.2398593 0.3422804 -0.2848889 0.0032411 0.0596405 0.5740965 -0.0001236 0.0014702 -0.0010195 -0.0237973 0.8061728 0.1055094 0.0000333 0.226329 0.8928179 0.0012382 -0.0012871 0.0022527 0.046675 0.0893774 0.0076207 0.0024464 -0.0168565 0.1310571 -0.0699011 0.0288692 -0.0857609 0.0597894 0.0908695 0.0069103 -0.0018185 -0.015982 0.1325565 0.0690953 -0.028457 0.0849135 0.057721 0.0040065 -0.0893032 -0.0001974 -0.0906482 -0.0536109 -0.0004545 -0.0020481 -0.0005829 0.0805759 0.0321261 0.0898454 0.000326 0.0493496 -0.0425643 -0.0002319 -0.0013875 0.0002268 0.0984966 unknown
polarizability: 72.1658961|-1.67717|62.0803947|-0.0456034|0.0078759|29.5071924 unknown
InChI: InChI=1S/C4H4N2O/c7-4-1-2-5-3-6-4/h2-3H,1H2
charge 0 multiplicity 1
11 atoms
O  -2.330454 0.042849 0.008693
N  -0.375486 -1.249073 -0.00297
N  1.831077 -0.08265 0.003628
C  -0.247628 1.309562 -0.004362
C  -1.078774 0.016217 -0.001127
C  1.247431 1.095176 0.001902
C  0.943178 -1.221005 -0.001675
H  -0.545509 1.927011 0.867699
H  -0.538773 1.917802 -0.88532
H  1.903766 1.97843 0.0061
H  1.475472 -2.17952 -0.004068
