program: Gaussian 09
title: 000104008
version: EM64L-G09RevD.01
frameworkgroup: C1[X(C14H16N2O2S)]
method: RPBEPBE
basis: SDD
operation: Freq
keyword: #p
keyword: freq=noraman
keyword: PBEPBE/SDD
title: #p freq=noraman PBEPBE/SDD
converged: YES YES NO NO
title: Mulliken charges:
elementType: S O O N N C C C C C C C C C C C C C C H H H H H H H H H H H H H H H H
charge: 0.810167 -0.526346 -0.525279 -0.283145 -0.196322 -0.413634 -0.412798 -0.217465 0.424777 0.194179 -0.267597 0.314521 -0.390051 -0.359753 -0.273331 -0.372750 -0.254184 -0.652927 -0.661758 0.252341 0.292810 0.292438 0.252356 0.310332 0.278150 0.272732 0.238796 0.243269 0.229354 0.248678 0.207272 0.230009 0.221347 0.265266 0.228546
chargesum: 0.00000
title: Mulliken charges with hydrogens summed into heavy atoms:
elementType: S O O N N C C C C C C C C C C C C C C
charge: 0.810167 -0.526346 -0.525279 -0.283145 -0.196322 0.131517 0.131995 -0.217465 0.424777 0.194179 0.042735 0.314521 -0.111901 -0.087021 -0.034535 -0.129481 -0.024829 0.033031 0.053401
polarizability: 3.11190395e+02 -1.29585891e+01 2.08296876e+02 2.08491314e+00 -3.04516904e+00 1.21053498e+02
1716.lowfreq: -10.6758 -4.2414 -0.0010 0.0003 0.0016 3.4100 16.1043 33.4400 48.9116
frequency: 15.8257 33.4039 48.8905 78.0240 86.1587 114.6786 139.9760 153.5678 167.6525 178.0087 188.2249 217.5134 229.7271 245.8109 264.8520 285.1412 310.9112 319.1767 340.4803 356.4399 367.5596 426.6789 460.9150 469.4372 488.0522 504.4339 521.6026 534.0512 577.1652 582.0447 661.8482 726.0153 731.1282 749.1374 757.4601 780.3675 793.5007 809.7788 812.4681 825.3412 834.1935 878.9516 919.8918 927.1712 944.0471 970.7231 972.2382 990.4212 1036.3384 1053.8349 1062.6850 1079.1951 1090.3983 1096.4624 1101.6561 1102.1412 1130.0554 1158.5029 1159.4156 1179.3011 1194.7863 1203.3689 1208.3136 1214.7831 1259.6084 1334.0281 1363.2710 1387.2114 1401.5321 1425.8559 1429.1302 1441.1470 1460.1104 1460.9805 1469.6563 1471.3480 1477.0017 1481.7101 1498.9645 1507.0280 1578.7000 1585.6583 1616.1378 2903.1124 2923.9491 3019.8915 3030.6496 3071.5954 3077.2714 3093.8502 3117.0790 3138.2607 3146.4028 3161.9536 3167.0164 3173.2004 3177.0226 3177.0607 3194.4312
redmass: 5.1523 4.0382 4.3048 2.4944 4.7259 3.7192 2.3967 5.6060 3.8159 4.0874 3.9737 2.0591 5.7002 2.8873 1.5246 3.4040 3.3054 5.4468 3.0046 3.0880 4.4606 7.8006 6.0522 3.4047 4.4921 5.8975 6.6173 5.5323 3.8857 4.1940 4.7852 6.9545 1.6550 1.9080 8.3773 5.0781 1.5177 15.0570 2.1719 4.6182 1.7442 1.4706 12.4839 4.2042 1.3505 1.0906 1.3177 1.3292 3.4970 1.4813 2.1133 1.2793 1.3561 1.3645 1.7319 1.3259 1.4239 1.5389 1.3768 1.4519 1.7077 2.0188 3.3174 1.8430 1.8626 2.0126 3.5101 4.5798 2.6306 2.3759 1.2794 1.4904 1.0728 1.5146 1.0880 1.1484 1.0710 1.0673 1.6371 1.9766 6.7955 5.2194 6.8730 1.0525 1.0491 1.0883 1.0795 1.0496 1.0626 1.1003 1.0962 1.0869 1.0869 1.0913 1.0926 1.0984 1.0988 1.1156 1.1153
irintensity: 3.8364 0.2658 0.9548 6.3830 1.8353 1.7801 3.5128 6.7112 3.9145 0.7659 0.4855 3.4331 26.2863 6.8573 2.8406 1.3977 1.0080 16.5819 0.7452 3.5224 5.4249 20.6995 48.2611 17.9463 5.3993 18.3005 87.2154 1.6818 9.3709 2.0924 4.9559 1.3661 2.0531 27.6544 0.1627 2.8377 99.2972 47.8880 13.9766 4.2660 52.5352 10.6424 72.2614 33.6743 1.0520 0.5335 1.6244 2.6178 42.1755 14.2626 24.9847 20.8740 5.6915 9.8647 0.6457 7.1266 41.5553 8.9762 0.4352 13.1138 6.2407 11.5934 13.8562 19.0898 17.1818 13.7956 66.1379 60.8392 27.6475 22.4467 5.5624 30.2601 15.2375 21.3100 35.4961 3.5822 24.3666 13.8094 4.8678 48.8541 79.5566 37.1051 15.8804 113.9263 155.1377 40.5480 37.5573 2.2397 26.2643 21.2292 18.3663 11.6786 3.3848 14.6799 6.1938 9.5310 16.3698 5.4326 2.7528
temp: 298.150 k
press: 1.00000 atm
elementType: 16 8 8 7 7 6 6 6 6 6 6 6 6 6 6 6 6 6 6 1 1 1 1 1 1 1 1 1 1 1 1 1 1 1 1
symmnumber: 1
zpe: 712281.4 jmol-1
zpe.correction: 0.271294 hartree
zpe.thermalcorrener: 0.290167 hartree
zpe.thermalcorrenthalpy: 0.291111 hartree
zpe.thermalcorrgfe: 0.223240 hartree
zpe.sumelectzpe: -1199.482098 hartree
zpe.sumelectthermal: -1199.463225 hartree
zpe.sumelectthermalent: -1199.462281 hartree
zpe.sumelectthermalfe: -1199.530152 hartree
dipole: 3.8693 3.6016 0.1774
dipole: 5.2891
quadrupole: -86.7657 -114.1446 -128.8666
quadrupole: -9.7239 2.0287 0.2701
quadrupole: 23.1600 -4.2190 -18.9410 -9.7239 2.0287 0.2701
hfenergy: -1199.753392 hartree
pointgroup: C01 [X(C14H16N2O2S1)]
dipole: -1.5144041 1.4224844 -0.114789 debye
polarizability: 310.2651603|10.7020737|207.312898|-15.8403306|-8.6675599|122.9627109 unknown
InChI: InChI=1S/C14H16N2O2S/c1-15(2)13-7-3-6-12-11(13)5-4-8-14(12)19(17,18)16-9-10-16/h3-8H,9-10H2,1-2H3
charge 0 multiplicity 1
35 atoms
S  2.544291 -0.550265 -0.347254
O  2.904277 -1.350726 1.032046
O  2.536482 -1.41331 -1.734279
N  3.845886 0.94517 -0.553568
N  -3.98916 0.493328 0.191887
C  4.97489 0.461016 -1.465326
C  5.18296 0.488197 0.032733
C  0.933817 0.418993 -0.158069
C  -0.277893 -0.332594 0.006315
C  -1.504014 0.446396 0.094513
C  1.009307 1.807238 -0.173675
C  -2.778256 -0.249879 0.203186
C  -0.325801 -1.758288 0.12805
C  -1.41792 1.875503 0.139251
C  -0.198527 2.544346 0.010254
C  -2.771063 -1.64879 0.368436
C  -1.553903 -2.385957 0.34073
C  -5.183663 -0.111546 0.801408
C  -4.310158 1.334722 -0.985165
H  5.379717 1.252346 -2.103743
H  4.829753 -0.510322 -1.956356
H  5.18322 -0.463803 0.579546
H  5.741883 1.30034 0.507911
H  1.972815 2.307222 -0.300056
H  0.592034 -2.349957 0.075207
H  -2.332561 2.445803 0.324064
H  -0.155737 3.636697 0.061855
H  -3.714807 -2.191108 0.47673
H  -1.591671 -3.474787 0.454812
H  -4.925339 -0.570502 1.770108
H  -5.664022 -0.884974 0.157542
H  -5.930765 0.68188 0.984041
H  -4.953316 0.781036 -1.705328
H  -3.393251 1.629728 -1.515647
H  -4.849806 2.249645 -0.675356
