program: Gaussian 09
title: 000103969
version: EM64L-G09RevD.01
frameworkgroup: C1[X(C6H5Cl5)]
method: RPBEPBE
basis: SDD
operation: Freq
keyword: #pfreq=noraman
keyword: PBEPBE/SDD
title: #p freq=noraman PBEPBE/SDD
converged: YES YES NO NO
title: Mulliken charges:
elementType: Cl Cl Cl Cl Cl C C C C C C H H H H H
charge: 0.040948 0.015194 -0.007040 -0.010638 0.003861 -0.416811 -0.370105 -0.426839 -0.401008 0.016960 -0.050095 0.316611 0.352010 0.340303 0.319920 0.276728
chargesum: 0.00000
title: Mulliken charges with hydrogens summed into heavy atoms:
elementType: Cl Cl Cl Cl Cl C C C C C C
charge: 0.040948 0.015194 -0.007040 -0.010638 0.003861 -0.100200 -0.018095 -0.086536 -0.081088 0.016960 0.226634
polarizability: 1.33153717e+02 -5.71127945e+00 1.18705316e+02 -1.92816574e+00 -1.62448727e+00 8.05019251e+01
1716.lowfreq: -11.0656 -6.1606 -5.1107 0.0016 0.0029 0.0031 34.6544 68.3207 97.2590
frequency: 34.5841 68.2949 97.2578 136.0474 153.6677 168.4987 176.7224 219.0185 270.2434 317.1249 334.8846 358.8471 411.1339 480.0518 522.0083 570.2874 651.2166 657.5820 711.0574 792.0514 869.7542 894.8588 952.1702 983.1442 1009.9039 1107.6732 1136.1282 1170.9332 1183.2499 1199.1525 1222.5323 1243.6613 1266.1135 1305.9265 1319.8225 1333.2723 1646.6058 3060.2532 3068.3501 3104.1546 3108.9093 3170.0714
redmass: 23.7065 23.0290 15.9769 21.5816 23.5729 23.9277 21.6675 8.4896 14.9850 8.6274 6.0997 8.8073 4.3147 7.8188 9.8091 4.6082 7.0857 5.7459 9.3737 4.1238 1.6228 3.7769 4.7232 3.2402 2.8647 3.3412 1.9641 1.1817 1.1157 1.1537 1.3745 1.2574 1.2051 1.7752 1.4589 1.3555 8.1423 1.0856 1.0862 1.0868 1.0883 1.0933
irintensity: 0.0065 0.2270 1.0943 0.7515 0.8342 0.5901 0.4000 2.9105 0.4083 0.4672 8.4263 14.1268 3.5443 30.4528 32.6324 11.6141 25.8835 49.9130 37.4324 32.8885 26.2700 26.4390 2.6691 13.7263 29.4669 7.2792 8.3092 5.4365 1.7991 15.0324 22.0172 8.5521 2.1903 13.1980 14.3909 12.7490 33.9602 4.0363 1.8455 0.6067 1.4706 1.9565
temp: 298.150 k
press: 1.00000 atm
elementType: 17 17 17 17 17 6 6 6 6 6 6 1 1 1 1 1
symmnumber: 1
zpe: 254130.0 jmol-1
zpe.correction: 0.096793 hartree
zpe.thermalcorrener: 0.108451 hartree
zpe.thermalcorrenthalpy: 0.109396 hartree
zpe.thermalcorrgfe: 0.056675 hartree
zpe.sumelectzpe: -2531.090016 hartree
zpe.sumelectthermal: -2531.078358 hartree
zpe.sumelectthermalent: -2531.077414 hartree
zpe.sumelectthermalfe: -2531.130134 hartree
dipole: 1.2928 0.8306 -2.8153
dipole: 3.2074
quadrupole: -106.9262 -102.2149 -97.0975
quadrupole: -0.0748 -1.7407 -1.3113
quadrupole: -4.8466 -0.1354 4.9820 -0.0748 -1.7407 -1.3113
hfenergy: -2531.1868094 hartree
pointgroup: C01 [X(C6H5Cl5)]
dipole: -0.5181541 0.3740829 1.0880916 debye
dipolederiv: -0.201594 0.1466235 0.0139766 0.1654115 -0.5511028 0.0205838 0.0286682 -0.032646 -0.0974092 -0.5297858 0.0203567 -0.0487953 0.0303223 -0.1439484 0.0014075 -0.0995601 0.011586 -0.1404145 -0.1736448 -0.005544 -0.0532419 -0.0664533 -0.2782409 -0.0917889 -0.1474116 -0.2802502 -0.4729492 -0.3392911 -0.1622154 0.0782226 -0.1971491 -0.4670796 0.154173 0.254264 0.2892996 -0.2870673 -0.81863 0.023674 0.115233 0.1148231 -0.1479342 -0.0257334 0.0791676 -0.0347554 -0.0332612 0.1360139 -0.1877628 -0.0355854 -0.1307989 0.6821654 -0.0010358 -0.1583589 0.0059472 0.0340791 0.6742204 0.0023816 0.1779886 -0.0380316 -0.0522728 0.0260289 0.1361791 -0.0080147 0.0636255 -0.0476983 -0.0182876 0.1162437 0.1046701 0.2725086 0.126858 0.2703879 0.2211019 0.7240111 0.3937099 0.2228448 -0.1377098 0.0811257 0.5209368 -0.2579299 -0.3072465 -0.3387247 0.3965424 1.20151 -0.0081295 -0.213504 -0.0754233 0.0955775 0.0280022 -0.1002832 0.1996427 -0.1537261 -0.3750256 -0.0012461 0.0570953 -0.0080727 -0.1023221 0.0730456 -0.0193253 -0.0083334 -0.1610626 0.0245328 0.0268602 -0.0335012 0.0176289 -0.0059518 -0.0457178 0.0335724 -0.0346694 -0.017585 -0.0043323 0.0085832 -0.0406905 0.009899 0.0688078 -0.0111122 -0.0122513 0.0032608 0.0303828 0.0317665 -0.0354521 0.0112691 -0.0394749 0.0512663 0.0052951 -0.0161521 -0.0169404 -0.0288004 -0.0060059 -0.0656848 -0.0196477 -0.022293 0.0151206 0.0273747 0.0479978 0.0413823 -0.0237599 0.0342542 0.0329982 0.012647 0.053816 0.0424697 -0.0294507 0.0103522 -0.0178863 0.1673944 unknown
polarizability: 133.299584|5.4968114|118.6713519|-1.5196313|0.2262358|80.390022 unknown
InChI: InChI=1S/C6H5Cl5/c7-2-1-3(8)5(10)6(11)4(2)9/h1-2,4-6H
charge 0 multiplicity 1
16 atoms
Cl 1.071947 -2.821341 0.196874
Cl 3.067138 -0.143231 0.448564
Cl -1.269608 -1.418546 -1.71896
Cl 1.2995 2.628984 -1.078841
Cl -3.342777 0.573012 0.556467
C  0.422372 -1.104924 0.56546
C  1.274951 -0.016647 -0.104227
C  -1.052605 -0.994341 0.131828
C  0.752603 1.38642 0.270555
C  -1.54873 0.402616 0.35794
C  -0.740041 1.49051 0.41936
H  0.471352 -1.022882 1.66511
H  1.29021 -0.162344 -1.194505
H  -1.66776 -1.751973 0.637696
H  1.267715 1.769757 1.166046
H  -1.147966 2.48963 0.600333
