program: Gaussian 09
title: 000103955
version: EM64L-G09RevD.01
frameworkgroup: C1[X(C14H24O2)]
method: RPBEPBE
basis: SDD
operation: Freq
keyword: #pfreq=noraman
keyword: PBEPBE/SDD
title: #p freq=noraman PBEPBE/SDD
converged: YES YES NO NO
title: Mulliken charges:
elementType: O O C C C C C C C C C C C C C C H H H H H H H H H H H H H H H H H H H H H H H H
charge: -0.256553 -0.251037 -0.369991 -0.379977 -0.367281 -0.380085 -0.390747 -0.392908 -0.484410 -0.282231 -0.155384 -0.233030 0.285908 -0.079433 -0.751544 -0.593384 0.191813 0.188780 0.197680 0.194100 0.187076 0.214643 0.195713 0.194145 0.202532 0.195940 0.212088 0.213328 0.204540 0.210071 0.227901 0.227577 0.217020 0.227671 0.213501 0.246931 0.244405 0.246779 0.213516 0.214336
chargesum: 0.00000
title: Mulliken charges with hydrogens summed into heavy atoms:
elementType: O O C C C C C C C C C C C C C C
charge: -0.256553 -0.251037 0.010601 0.011803 0.034438 0.009773 0.007726 0.032509 -0.069799 0.173246 0.061637 -0.005359 0.285908 0.134068 -0.013428 -0.165532
polarizability: 1.92758355e+02 -2.42702388e+01 1.86355796e+02 -2.89527179e+00 1.00996428e+01 1.23770246e+02
1716.lowfreq: -38.7741 -3.9057 -0.0010 -0.0005 0.0009 3.9976 8.1008 16.8805 19.4388
frequency: -38.7417 16.7141 19.3079 26.0119 40.9725 50.2237 68.1090 85.6165 99.6441 108.7784 129.4600 144.7119 151.6901 161.2392 183.5991 189.6756 201.8634 239.9102 291.0878 315.4372 381.4911 420.3365 430.5198 468.4247 482.1265 517.2553 567.1704 613.9737 645.8892 722.0492 733.7003 759.9585 805.5875 820.1976 832.3708 880.3730 887.5542 927.7043 932.9414 937.8066 955.3127 959.1105 992.3318 1001.5488 1011.3898 1018.5051 1020.8729 1038.6901 1041.6783 1070.4804 1079.4231 1085.8951 1104.6149 1125.3780 1150.4414 1176.3752 1200.8933 1207.4322 1210.1045 1227.9461 1246.2725 1260.5615 1269.6635 1274.5740 1280.4844 1282.7075 1290.3035 1293.5904 1299.8796 1306.0769 1325.1886 1338.2277 1356.7134 1357.0836 1370.9963 1382.6725 1430.5189 1453.1799 1454.8195 1455.8524 1460.5188 1462.2997 1465.7127 1468.8626 1475.7196 1483.6970 1489.6320 1614.9118 1648.8973 1666.3089 2949.6473 2950.1764 2953.8570 2958.0258 2962.5158 2967.6655 2987.0516 2988.7277 2996.9943 2999.6467 3005.9984 3007.7242 3018.6803 3026.6943 3040.0144 3046.0213 3065.0570 3073.7605 3079.1113 3090.6437 3095.8741 3097.6523 3143.0054 3203.0131
redmass: 1.0353 5.3073 5.7788 3.2794 4.4199 2.8981 1.8145 2.3105 3.0273 2.2322 2.1801 1.9550 3.1411 2.7950 5.0143 2.7598 3.2458 2.0549 2.8299 3.8319 3.0049 2.6554 2.8052 3.4150 3.1480 2.3695 2.9923 4.8736 1.3687 1.0670 1.1017 1.1537 1.3407 1.5662 5.5741 1.6792 1.5594 1.2783 3.0732 2.1189 1.5992 1.2513 1.9200 2.1155 2.3655 1.1241 2.1967 2.4088 1.6678 2.8619 2.3372 2.1496 3.0519 1.9980 1.4135 1.5004 1.5955 3.5726 1.5057 1.2945 1.3183 1.2790 1.2855 1.1532 1.2571 1.1611 1.1163 1.1329 1.2085 1.3088 1.3662 1.3904 1.5892 1.5882 1.4797 1.3114 1.2501 1.0635 1.0471 1.0983 1.0802 1.0693 1.0756 1.0855 1.0935 1.0963 1.0979 4.2484 9.1904 5.7850 1.0608 1.0593 1.0593 1.0614 1.0603 1.0600 1.0964 1.0599 1.0985 1.0566 1.1009 1.0367 1.0992 1.1025 1.1037 1.1045 1.0917 1.1078 1.0837 1.0779 1.0974 1.0797 1.1010 1.1143
irintensity: 1.1232 0.3399 1.4452 0.2772 0.4036 0.0324 0.2439 0.1594 0.4204 0.2729 0.7425 0.0143 1.4302 0.2753 4.7452 7.2722 1.7160 1.1816 0.2256 8.2486 1.1220 0.9516 2.1536 2.4804 0.2238 1.2482 2.6678 4.6636 3.2351 12.6262 0.6435 3.7952 4.0719 5.2661 16.9516 7.1322 1.9449 41.1611 38.1317 5.2224 1.6719 45.5893 8.0688 100.9339 10.5720 76.8921 5.0150 9.7252 9.3279 3.8699 4.9964 5.3358 10.3778 0.7558 1.7119 8.8013 4.8480 381.1597 2.7340 11.6229 1.2471 0.7931 1.0447 0.4524 0.6886 0.6782 0.3901 0.2069 2.8502 1.8511 1.2932 0.4816 0.5207 4.3305 11.9501 42.6992 4.8205 28.5676 17.8776 14.6556 0.7151 0.1129 0.2441 0.6231 1.8859 1.7305 25.8176 8.8576 205.2060 22.2548 23.0101 3.4353 1.3114 9.4482 7.8248 158.6463 2.3105 17.6400 0.3229 41.4621 8.8333 4.4420 19.8578 1.6754 59.1422 96.3059 29.2833 84.6624 0.5566 46.9051 9.4158 10.4884 11.8725 26.3576
temp: 298.150 k
press: 1.00000 atm
elementType: 8 8 6 6 6 6 6 6 6 6 6 6 6 6 6 6 1 1 1 1 1 1 1 1 1 1 1 1 1 1 1 1 1 1 1 1 1 1 1 1
symmnumber: 1
zpe: 913010.2 jmol-1
zpe.correction: 0.347747 hartree
zpe.thermalcorrener: 0.367269 hartree
zpe.thermalcorrenthalpy: 0.368213 hartree
zpe.thermalcorrgfe: 0.295109 hartree
zpe.sumelectzpe: -697.024708 hartree
zpe.sumelectthermal: -697.005187 hartree
zpe.sumelectthermalent: -697.004242 hartree
zpe.sumelectthermalfe: -697.077347 hartree
dipole: -1.3820 0.5198 0.7331
dipole: 1.6486
quadrupole: -120.7966 -97.8345 -95.4827
quadrupole: 14.3799 7.5940 -1.4324
quadrupole: -16.0920 6.8701 9.2219 14.3799 7.5940 -1.4324
hfenergy: -697.3724555 hartree
pointgroup: C01 [X(C14H24O2)]
dipole: 0.5435713 0.2030447 -0.2897851 debye
polarizability: 192.8581062|24.2304412|186.2283971|-3.08913|-10.1907336|123.797893 unknown
InChI: InChI=1S/C14H24O2/c1-3-4-5-6-7-8-9-10-11-12-13-16-14(2)15/h3-5H,1,6-13H2,2H3
charge 0 multiplicity 1
40 atoms
O  -5.151088 0.776115 -0.174861
O  -6.906785 -0.528031 0.632053
C  0.798108 -1.466063 0.103235
C  -0.292004 -0.421822 -0.22704
C  2.215721 -1.015935 -0.3156
C  -1.713586 -0.876639 0.173472
C  3.303184 -2.063662 0.008662
C  -2.794829 0.173638 -0.173651
C  4.731112 -1.635831 -0.436363
C  -4.193125 -0.301265 0.220251
C  5.265576 -0.444191 0.324352
C  5.701019 0.725671 -0.233045
C  -6.501486 0.526821 0.092517
C  6.221621 1.855883 0.538813
C  -7.353865 1.693489 -0.360638
C  6.663797 3.029186 -0.000974
H  0.786818 -1.677135 1.193235
H  0.55282 -2.424451 -0.401153
H  -0.053368 0.532636 0.286425
H  -0.271453 -0.202869 -1.314992
H  2.226258 -0.806405 -1.406056
H  2.465314 -0.058944 0.185158
H  -1.736195 -1.09036 1.262367
H  -1.947314 -1.834007 -0.337352
H  3.048488 -3.02281 -0.486719
H  3.30694 -2.266455 1.099973
H  -2.776785 0.386117 -1.26006
H  -2.574206 1.127143 0.343825
H  4.730962 -1.419552 -1.523041
H  5.413255 -2.499157 -0.282313
H  -4.287955 -0.472926 1.308764
H  -4.480915 -1.234067 -0.299713
H  5.298792 -0.548714 1.42202
H  5.668224 0.843584 -1.327058
H  6.249918 1.727152 1.631932
H  -7.039452 2.617107 0.155389
H  -8.411224 1.486306 -0.142483
H  -7.221975 1.862205 -1.443452
H  7.044134 3.843734 0.624165
H  6.655248 3.199904 -1.084846
