program: Gaussian 09
title: 000103966
version: EM64L-G09RevD.01
frameworkgroup: C1[X(C13H20O8Si)]
method: RPBEPBE
basis: SDD
operation: Freq
keyword: #p
keyword: freq=noraman
keyword: PBEPBE/SDD
title: #p freq=noraman PBEPBE/SDD
converged: YES YES NO NO
title: Mulliken charges:
elementType: Si O O O O O O O O C C C C C C C C C C C C C H H H H H H H H H H H H H H H H H H H H
charge: 1.630820 -0.540340 -0.540371 -0.563128 -0.276091 -0.242842 -0.242819 -0.214974 -0.246935 -0.924278 -0.334214 -0.263686 0.296424 0.296511 0.303023 0.161539 -0.732402 -0.732434 -0.735884 0.342475 -0.755401 -0.630654 0.291920 0.291653 0.224125 0.223711 0.230798 0.230385 0.244787 0.251600 0.261778 0.244804 0.251539 0.261827 0.256142 0.256019 0.244342 0.239745 0.239669 0.215730 0.229212 0.255875
chargesum: 0.00000
title: Mulliken charges with hydrogens summed into heavy atoms:
elementType: Si O O O O O O O O C C C C C C C C C C C C C
charge: 1.630820 -0.540340 -0.540371 -0.563128 -0.276091 -0.242842 -0.242819 -0.214974 -0.246935 -0.340705 0.113622 0.197498 0.296424 0.296511 0.303023 0.161539 0.025763 0.025736 0.020619 0.342475 -0.060257 -0.145567
polarizability: 2.30242900e+02 4.26996138e-01 1.63323261e+02 3.78231507e+00 5.15241762e-01 1.77550087e+02
1716.lowfreq: -13.5878 -4.0085 -3.2057 -0.0009 -0.0004 -0.0004 6.9935 10.3126 13.2925
frequency: -13.5280 9.5645 10.6758 25.3337 30.6495 40.2618 42.7093 46.2277 51.4691 59.4361 64.4716 83.2962 84.7310 100.1376 100.9884 103.5812 119.8533 124.8097 128.4687 139.6346 156.9461 168.4702 173.6376 206.6279 207.4944 251.5829 263.4362 312.6058 337.1830 361.6123 380.8787 388.7024 393.1853 435.4751 504.0302 555.9649 556.1183 562.8447 563.2707 576.2995 601.1591 605.4804 627.0579 632.3484 666.0836 690.4036 749.3941 782.6878 783.9529 812.5233 824.5559 902.6113 908.7745 919.9271 924.5184 957.7260 989.5544 991.7412 994.1656 1003.3522 1006.2166 1031.8609 1034.3591 1043.5373 1044.8555 1044.8934 1052.9712 1082.6274 1113.2725 1165.9042 1181.2502 1196.8406 1226.1465 1242.2541 1260.1476 1287.2325 1293.6590 1327.6410 1376.3654 1383.4914 1383.5003 1384.3146 1394.5204 1414.4601 1426.8717 1448.7294 1449.4919 1450.1396 1450.5828 1450.6523 1450.7245 1455.5704 1468.5992 1472.1021 1483.2178 1609.1503 1633.2397 1640.5870 1653.6985 1660.6074 2989.9467 2998.3233 3003.4100 3008.8496 3008.8637 3009.2846 3010.9963 3048.0392 3069.8005 3073.6772 3084.5175 3096.8240 3096.8495 3097.9564 3098.0290 3104.1288 3144.8386 3145.6743 3145.7811 3216.4890
redmass: 6.2629 4.5567 6.3570 4.5502 8.7137 3.8648 3.6496 3.7481 3.5750 4.7905 3.8740 4.9652 2.0382 1.0804 1.0847 1.0692 6.5223 5.0495 7.9312 8.9175 1.0896 9.6337 3.2514 2.8954 4.2023 7.0161 4.5688 4.4224 3.4920 3.7699 3.0440 3.6942 3.6106 4.5579 5.1012 2.9972 3.9880 3.0391 3.3060 3.8962 5.5033 6.6484 8.2694 1.5301 6.2259 7.5787 1.1917 7.0031 2.0734 7.4322 1.3433 6.5906 7.6214 7.6827 3.4497 2.8325 1.3184 1.9406 1.8329 1.7428 1.4080 4.2456 1.3612 1.6822 1.6875 1.6893 1.5055 2.9223 4.7543 1.2003 3.5640 3.8995 3.8917 1.3619 1.2185 3.1143 1.0778 1.4165 1.5156 1.2401 1.2400 1.2515 1.1672 1.2494 1.0842 1.0638 1.0564 1.0501 1.0553 1.0497 1.0582 1.0454 1.0711 1.0666 1.0887 11.3525 9.3365 9.2237 5.2029 9.9199 1.0360 1.0595 1.0577 1.0366 1.0367 1.0364 1.0570 1.1027 1.1050 1.0971 1.1054 1.0968 1.0968 1.1009 1.0971 1.0618 1.1017 1.1017 1.1016 1.1157
irintensity: 0.8006 0.3445 0.1302 0.0023 1.4257 3.4247 1.1008 0.1496 9.5242 0.6424 1.4676 0.0103 0.2538 0.2723 0.1017 0.0100 0.1776 12.2033 1.6396 1.0654 0.5243 1.4307 1.5836 8.7686 0.2914 22.6043 35.0821 24.9879 15.2614 8.0202 11.1694 32.5711 0.7631 32.8615 4.8097 2.1915 0.8278 6.3366 15.1836 6.6580 0.0222 18.2133 15.0559 9.5998 34.3437 67.5610 29.4781 64.8151 6.8421 0.8111 5.5128 431.4370 4.9567 246.5752 84.2914 17.9742 50.1526 166.2501 200.5475 28.2929 15.1882 13.1009 70.2607 4.3817 7.6024 25.8645 5.6593 94.3783 484.9916 18.5263 398.3627 761.7503 63.7172 26.1982 3.0426 116.5279 0.1324 0.0785 0.6411 75.8628 75.7185 46.4238 21.2124 11.6371 29.7632 12.9971 43.2455 1.0861 42.3461 20.4161 23.7086 15.3281 19.6714 22.9947 11.7698 143.5926 81.7959 178.5713 7.3083 250.9002 15.8186 1.1299 8.3533 0.4914 0.5803 0.5525 24.9025 0.4391 5.5741 16.3265 32.1581 2.7152 6.5340 28.1334 4.3395 5.6979 11.9635 19.4723 1.6893 5.5050
temp: 298.150 k
press: 1.00000 atm
elementType: 14 8 8 8 8 8 8 8 8 6 6 6 6 6 6 6 6 6 6 6 6 6 1 1 1 1 1 1 1 1 1 1 1 1 1 1 1 1 1 1 1 1
symmnumber: 1
zpe: 835706.7 jmol-1
zpe.correction: 0.318304 hartree
zpe.thermalcorrener: 0.345780 hartree
zpe.thermalcorrenthalpy: 0.346724 hartree
zpe.thermalcorrgfe: 0.253080 hartree
zpe.sumelectzpe: -1396.976191 hartree
zpe.sumelectthermal: -1396.948715 hartree
zpe.sumelectthermalent: -1396.947771 hartree
zpe.sumelectthermalfe: -1397.041415 hartree
dipole: 0.1117 0.0540 2.9141
dipole: 2.9167
quadrupole: -132.5500 -133.6799 -133.8671
quadrupole: -0.2185 -19.1385 -0.0236
quadrupole: 0.8157 -0.3143 -0.5014 -0.2185 -19.1385 -0.0236
hfenergy: -1397.2944953 hartree
pointgroup: C01 [X(C13H20O8Si1)]
dipole: -0.0422096 -0.0212752 1.1465533 debye
polarizability: 230.233291|0.1136969|163.3209339|-3.8682341|-0.5006238|177.5620224 unknown
InChI: InChI=1S/C13H20O8Si/c1-9(2)13(17)18-7-6-8-22(19-10(3)14,20-11(4)15)21-12(5)16/h1,6-8H2,2-5H3
charge 0 multiplicity 1
42 atoms
Si -1.788147 0.00631 0.003445
O  -1.947734 -1.312954 1.150912
O  -1.925287 1.313479 1.1677
O  -3.099855 0.024237 -1.139891
O  3.513211 -0.027833 -0.093586
O  -1.631456 -3.037593 -0.366813
O  -1.590742 3.051643 -0.330418
O  -4.976634 0.034941 0.234867
O  4.886402 0.015461 -1.975834
C  -0.191839 0.000246 -0.987299
C  1.089156 -0.014846 -0.113417
C  2.334499 -0.009474 -1.003329
C  -1.877244 -2.667119 0.803821
C  -1.836904 2.670606 0.836741
C  -4.489353 0.03617 -0.91195
C  4.766263 -0.012514 -0.725804
C  -2.13797 -3.550074 1.998106
C  -2.080471 3.542554 2.042679
C  -5.23835 0.051129 -2.222181
C  5.880506 -0.033292 0.279503
C  5.537514 -0.071587 1.754314
C  7.152986 -0.015996 -0.205333
H  -0.226341 -0.889952 -1.64322
H  -0.213172 0.899356 -1.631602
H  1.113793 -0.912664 0.532234
H  1.121239 0.86765 0.552734
H  2.389297 0.894004 -1.638753
H  2.380108 -0.896577 -1.662181
H  -2.021633 -4.607471 1.721323
H  -1.446697 -3.290715 2.818069
H  -3.161526 -3.368613 2.370474
H  -1.949283 4.601447 1.778556
H  -1.390552 3.262778 2.857039
H  -3.105454 3.371807 2.416222
H  -4.946645 0.940011 -2.807936
H  -4.9627 -0.835448 -2.819069
H  -6.32208 0.059853 -2.037934
H  4.928703 0.804123 2.042416
H  4.934821 -0.964899 1.99782
H  6.453993 -0.083924 2.368144
H  8.019121 -0.029197 0.464906
H  7.335659 0.011839 -1.285076
