program: Gaussian 09
title: 000104019
version: EM64L-G09RevD.01
frameworkgroup: C1[X(C18H14Br6N2O2)]
method: RPBEPBE
basis: SDD
operation: Freq
keyword: #p
keyword: freq=noraman
keyword: PBEPBE/SDD
title: #p freq=noraman PBEPBE/SDD
converged: YES YES NO NO
title: Mulliken charges:
elementType: Br Br Br Br Br Br O O N N C C C C C C C C C C C C C C C C C C H H H H H H H H H H H H H H
charge: 0.018417 0.062000 0.070211 0.055662 0.058465 0.044649 -0.208172 -0.203179 -0.475284 -0.481628 -0.388569 -0.359791 -0.540575 -0.526028 0.199063 0.187176 0.677116 0.696600 -0.358842 -0.384416 -0.328627 -0.332004 -0.151620 -0.145601 -0.155739 -0.157878 -0.238121 -0.238803 0.189722 0.233188 0.237016 0.225107 0.238156 0.251871 0.219361 0.247972 0.324683 0.326054 0.280230 0.276841 0.279101 0.276216
chargesum: 0.00000
title: Mulliken charges with hydrogens summed into heavy atoms:
elementType: Br Br Br Br Br Br O O N N C C C C C C C C C C C C C C C C C C
charge: 0.018417 0.062000 0.070211 0.055662 0.058465 0.044649 -0.208172 -0.203179 -0.150601 -0.155574 0.034342 0.102332 -0.050548 -0.058695 0.199063 0.187176 0.677116 0.696600 -0.358842 -0.384416 -0.328627 -0.332004 0.128611 0.131239 0.123362 0.118338 -0.238121 -0.238803
polarizability: 3.52692331e+02 7.67539186e+00 3.67360509e+02 5.97245782e+01 -1.17744374e+01 2.39670730e+02
1716.lowfreq: -3.9679 -2.4340 -0.0007 -0.0006 -0.0005 2.8234 6.1416 8.9291 10.0212
frequency: 5.9586 8.7503 9.9818 19.6751 22.0422 34.7226 41.3417 50.9802 53.7629 71.0691 96.0142 96.7639 106.0253 111.3726 111.7225 116.1413 124.8254 130.4165 146.7849 155.9769 177.4977 178.1128 188.0960 212.7008 220.4770 221.1945 248.6478 252.3257 296.1202 314.2176 338.1350 340.3747 351.0695 353.7038 384.4832 403.9184 422.4777 487.7674 500.0683 502.1548 508.1494 516.3117 539.5283 555.5567 563.7126 571.7827 589.4167 658.4306 665.5730 692.5931 701.8069 705.5626 707.8410 717.1370 735.5428 750.7194 831.0753 841.8183 860.7116 865.0164 865.6525 876.5704 879.8363 889.2114 913.3553 929.0012 993.4452 1028.7823 1035.8173 1038.8441 1046.6406 1065.2428 1096.5563 1097.5188 1112.4921 1166.3013 1183.8906 1183.9766 1214.2552 1224.5401 1254.0793 1262.1414 1266.4584 1270.5107 1301.2401 1314.3403 1326.7309 1330.8566 1332.8977 1358.7589 1359.3885 1372.4108 1429.4548 1430.1650 1444.7306 1451.0309 1460.1220 1462.2961 1468.3105 1483.3284 1537.2663 1539.9227 1565.2512 1566.4221 1634.1073 1644.5530 2963.1111 2980.2712 2994.0465 3001.2726 3024.9602 3051.6464 3085.0494 3088.7364 3186.1377 3186.5955 3188.1468 3189.4690 3487.9485 3518.2621
redmass: 28.3375 32.7425 31.2847 27.7918 21.1097 18.6025 7.9684 8.6815 7.0229 8.0823 4.2296 6.3260 6.3046 34.9074 26.3964 8.7316 11.5457 10.0776 8.1232 6.4433 4.6210 4.6165 3.2300 4.4210 65.6310 41.3580 5.6799 5.7741 4.2229 6.5884 7.0605 7.1884 7.3016 6.9004 3.7206 3.6870 4.3555 1.4565 4.0602 4.2501 3.7995 4.7779 2.4927 4.1881 3.9653 2.1778 3.9642 4.0640 5.2027 3.4203 6.2244 8.5077 8.6262 3.8882 3.5409 1.8071 2.5423 4.5184 3.0589 1.4461 1.4488 1.3768 1.3893 2.5874 2.9120 5.4881 2.6794 2.9623 3.6532 4.2201 2.8163 2.0935 2.5338 2.4439 1.6345 1.5789 1.6625 1.6534 1.8721 2.2812 1.5933 2.1159 1.9397 1.3407 1.1789 1.2567 1.8933 3.8125 2.0803 4.5153 4.5849 1.3918 2.5619 2.7884 2.1200 1.8019 1.1561 1.2003 1.0914 1.1030 7.4454 7.1868 8.2450 8.4972 7.1537 7.0747 1.0640 1.0651 1.0608 1.0650 1.0947 1.1008 1.0985 1.0990 1.0931 1.0932 1.0939 1.0939 1.0770 1.0765
irintensity: 0.0862 0.4061 0.1527 0.2803 0.0946 0.3020 1.5510 9.0191 3.7957 2.5225 1.5121 0.5188 1.8193 0.2773 0.0589 3.0185 1.3174 2.1653 1.8510 4.6268 0.4842 0.3233 2.0895 5.3263 0.0853 0.0303 1.4365 1.1008 6.3036 1.7287 2.7585 2.4250 2.0558 3.7379 13.6192 10.9804 4.9931 81.8151 5.2036 3.4728 4.0119 31.4952 43.2527 27.6682 11.5966 30.6657 23.2075 15.7177 21.0968 12.6505 16.6317 75.3737 73.5787 22.0564 40.5425 38.2332 28.5854 6.4409 18.9086 28.8902 19.2893 2.6981 2.9943 2.6386 2.3494 3.9468 1.4883 12.0804 9.4754 3.4238 13.1524 27.2906 30.3076 15.2567 25.1582 39.9986 2.8220 29.3971 11.3391 65.8408 2.9467 24.7173 37.8025 13.2672 8.0985 3.4457 17.0248 44.0251 34.8598 26.7897 31.0541 1.3637 30.3669 145.1420 228.0842 434.8607 39.9842 47.3761 7.3268 27.7183 83.2903 66.5289 69.0293 54.0806 113.1124 177.4712 24.7063 14.2288 23.1694 23.4708 16.0959 34.9159 26.5410 25.4641 0.6985 0.9660 0.2156 0.5859 86.2670 19.1337
temp: 298.150 k
press: 1.00000 atm
elementType: 35 35 35 35 35 35 8 8 7 7 6 6 6 6 6 6 6 6 6 6 6 6 6 6 6 6 6 6 1 1 1 1 1 1 1 1 1 1 1 1 1 1
symmnumber: 1
zpe: 736543.8 jmol-1
zpe.correction: 0.280535 hartree
zpe.thermalcorrener: 0.310816 hartree
zpe.thermalcorrenthalpy: 0.311760 hartree
zpe.thermalcorrgfe: 0.208517 hartree
zpe.sumelectzpe: -1033.013751 hartree
zpe.sumelectthermal: -1032.983470 hartree
zpe.sumelectthermalent: -1032.982526 hartree
zpe.sumelectthermalfe: -1033.085769 hartree
dipole: -4.5313 -1.0059 3.6920
dipole: 5.9309
quadrupole: -227.8358 -205.9511 -224.9466
quadrupole: 18.5657 0.0133 -6.1506
quadrupole: -8.2580 13.6267 -5.3688 18.5657 0.0133 -6.1506
hfenergy: -1033.2942859 hartree
pointgroup: C01 [X(C18H14Br6N2O2)]
dipole: 1.8118178 0.178804 1.4594659 debye
polarizability: 350.0939559|17.2998537|360.9897685|-60.1331628|29.8756023|248.6398463 unknown
InChI: InChI=1S/C18H14Br6N2O2/c19-9-5-11(21)17(12(22)6-9)25-15(27)3-1-2-4-16(28)26-18-13(23)7-10(20)8-14(18)24/h5-8,25-26H,1-4H2
charge 0 multiplicity 1
42 atoms
Br 1.359679 -0.090556 2.429797
Br -0.965318 -0.902947 -1.679349
Br 5.632573 0.317126 -1.554921
Br -4.973723 0.679119 2.277599
Br 4.187535 -4.811734 0.650876
Br -6.139111 -3.499354 -1.524149
O  2.455343 1.313803 -1.91342
O  -3.49395 2.678745 0.063328
N  3.215686 1.32117 0.295488
N  -2.211818 0.805952 0.644844
C  1.207714 3.684698 0.316909
C  -0.079954 2.957845 -0.127838
C  2.391442 3.440237 -0.664376
C  -1.212228 3.032366 0.931995
C  2.689504 1.950123 -0.851376
C  -2.423724 2.193806 0.514446
C  3.46241 -0.076903 0.380342
C  -3.11692 -0.183592 0.173462
C  2.727219 -0.902537 1.275668
C  -2.744377 -1.06893 -0.878426
C  4.456714 -0.723837 -0.407211
C  -4.415165 -0.35886 0.727838
C  2.929778 -2.290485 1.385639
C  -3.610225 -2.05827 -1.382678
C  4.667209 -2.117449 -0.348764
C  -5.319751 -1.318289 0.226556
C  3.897874 -2.882992 0.549082
C  -4.901201 -2.155649 -0.825612
H  1.484105 3.352381 1.339867
H  1.025103 4.774294 0.384897
H  -0.441497 3.387577 -1.081635
H  0.158678 1.898979 -0.344127
H  3.296119 3.967697 -0.304843
H  2.140031 3.837888 -1.661739
H  -0.827341 2.681726 1.910952
H  -1.557829 4.072379 1.055287
H  3.244874 1.861643 1.163915
H  -1.262649 0.495568 0.875828
H  2.343447 -2.889174 2.085362
H  -3.291903 -2.716445 -2.193643
H  5.42878 -2.585823 -0.975718
H  -6.315137 -1.419396 0.663847
