program: Gaussian 09
title: 000103970
version: EM64L-G09RevD.01
frameworkgroup: C1[X(C14H15F7O2)]
method: RPBEPBE
basis: SDD
operation: Freq
keyword: #p
keyword: freq=noraman
keyword: PBEPBE/SDD
title: #p freq=noraman PBEPBE/SDD
converged: YES YES NO NO
title: Mulliken charges:
elementType: F F F F F F F O O C C C C C C C C C C C C C C H H H H H H H H H H H H H H H
charge: -0.156538 -0.141566 -0.130194 -0.118124 -0.136579 -0.126615 -0.119175 -0.139179 -0.120330 0.339412 0.249999 -0.269657 -0.291935 -0.539187 -0.505326 0.035628 -0.783148 -0.776853 -0.803827 0.079160 0.178132 0.216011 0.379265 0.283970 0.320214 0.248292 0.265943 0.257612 0.241815 0.238627 0.222388 0.223267 0.224640 0.238381 0.226757 0.245091 0.228678 0.214951
chargesum: 0.00000
title: Mulliken charges with hydrogens summed into heavy atoms:
elementType: F F F F F F F O O C C C C C C C C C C C C C C
charge: -0.156538 -0.141566 -0.130194 -0.118124 -0.136579 -0.126615 -0.119175 -0.139179 -0.120330 0.339412 0.249999 0.014313 0.028279 -0.024951 -0.005899 0.035628 -0.098866 -0.087075 -0.115106 0.079160 0.178132 0.216011 0.379265
polarizability: 1.81287507e+02 5.46943263e+00 1.40587732e+02 4.45389071e+00 -1.47563164e+00 1.42319470e+02
1716.lowfreq: -11.5667 -5.0811 -0.0009 -0.0008 -0.0008 10.9332 13.2200 27.4528 33.1927
frequency: 11.6737 27.3107 32.3706 52.9750 61.3281 105.4956 118.3378 135.6969 142.1184 158.5537 162.0299 181.3286 197.9267 206.0956 207.6905 229.2146 234.8572 248.9489 257.8412 262.8266 279.7066 285.6625 298.6299 310.6342 331.7602 348.5837 385.9852 393.0328 414.4912 434.8013 458.7117 468.6157 510.5596 516.0043 535.8821 548.3704 562.4242 583.7883 610.6035 637.8140 661.4036 678.3312 722.5390 738.3719 807.7304 829.5358 854.6199 870.1830 896.7294 901.2820 937.3889 947.4153 953.3462 959.9327 990.7182 1000.8319 1008.4449 1015.0447 1021.4064 1030.5220 1052.0196 1056.0256 1081.7758 1083.6609 1103.0787 1123.0706 1132.4732 1142.8871 1151.6587 1168.5043 1190.9153 1202.8804 1207.6627 1218.2161 1237.4732 1265.5516 1279.4515 1300.3947 1313.4042 1323.8112 1385.9668 1392.4742 1407.3985 1459.1870 1465.2797 1467.9291 1474.8476 1480.2024 1489.9530 1493.6671 1503.8662 1618.6454 1677.4436 2981.4178 2984.7938 2986.7328 3012.3055 3032.6988 3044.1632 3066.0908 3070.2454 3072.1709 3074.4739 3076.7131 3079.3201 3083.5566 3092.8063 3103.2094
redmass: 8.2861 10.0459 7.4294 6.1387 7.8153 9.5683 8.3333 1.9059 3.8174 2.6098 2.2738 1.6371 1.4719 5.2563 3.4276 2.5905 4.1011 3.8037 5.3676 11.1186 6.3339 2.6810 7.6323 16.4297 9.6911 3.1965 2.9623 6.2397 3.2327 10.2600 12.6450 3.8325 8.5414 8.4288 4.0427 5.7518 3.9690 14.1869 6.1295 7.5284 8.4740 5.7135 2.9282 3.3215 2.4395 2.6855 2.0964 4.0401 4.8840 2.6729 1.9161 1.4703 2.4300 3.9900 1.5171 7.1034 4.5190 1.9721 3.9211 3.8944 7.5335 9.0407 2.3257 2.2057 1.6952 3.5659 4.1103 3.2916 2.3581 1.5899 1.7709 9.9960 2.2909 1.4691 1.5858 2.4991 1.6320 1.4922 2.3401 1.5780 1.2012 1.2254 1.1891 1.0570 1.0504 1.0550 1.0538 1.0613 1.0618 1.0725 1.0653 9.9797 11.9876 1.0367 1.0367 1.0373 1.0606 1.0641 1.0820 1.0990 1.1029 1.0934 1.0947 1.0982 1.0993 1.0988 1.1026 1.0965
irintensity: 0.7417 0.4948 0.7320 0.2186 0.5977 1.9494 1.0053 0.9526 0.4973 2.1279 0.5667 0.5718 0.2629 2.7857 1.4735 1.2410 2.5956 1.7982 2.3448 0.8890 0.3956 1.0543 1.3610 1.0893 1.0951 1.3626 0.6539 2.6544 1.5951 5.5755 16.1334 1.4096 4.2379 2.2411 8.2381 0.6299 3.6328 12.8197 4.6214 42.3178 6.0184 5.9288 8.5702 30.2226 18.6829 18.9033 3.7528 48.8150 38.4141 10.1174 3.5249 1.3775 32.8545 44.0711 3.3084 41.5496 144.3976 14.8807 21.1192 25.4538 19.1228 344.7900 135.2156 142.4270 1.8922 7.4137 22.0539 18.6523 8.8374 26.8022 8.3737 54.0568 9.0329 4.4170 1.0411 12.7785 22.7583 11.9858 6.5187 115.6120 18.2095 18.6100 17.6355 7.9720 8.6937 8.0189 6.1997 8.2139 11.0746 20.2234 11.2026 91.9901 167.6822 18.7572 15.3652 41.2809 24.4662 25.4395 1.5226 4.9423 1.3157 3.4559 55.2826 31.6093 23.1851 12.5263 33.2312 24.7236
temp: 298.150 k
press: 1.00000 atm
elementType: 9 9 9 9 9 9 9 8 8 6 6 6 6 6 6 6 6 6 6 6 6 6 6 1 1 1 1 1 1 1 1 1 1 1 1 1 1 1
symmnumber: 1
zpe: 708721.2 jmol-1
zpe.correction: 0.269938 hartree
zpe.thermalcorrener: 0.293110 hartree
zpe.thermalcorrenthalpy: 0.294054 hartree
zpe.thermalcorrgfe: 0.216570 hartree
zpe.sumelectzpe: -1390.033498 hartree
zpe.sumelectthermal: -1390.010326 hartree
zpe.sumelectthermalent: -1390.009381 hartree
zpe.sumelectthermalfe: -1390.086866 hartree
dipole: 5.3373 -0.9926 2.8408
dipole: 6.1272
quadrupole: -124.0318 -139.1706 -137.5945
quadrupole: -4.8972 1.6679 2.7146
quadrupole: 9.5672 -5.5717 -3.9955 -4.8972 1.6679 2.7146
hfenergy: -1390.3034353 hartree
pointgroup: C01 [X(C14H15F7O2)]
dipole: -2.0459081 0.5691295 1.1408018 debye
polarizability: 181.5119927|2.9536985|140.3014916|-5.5493724|1.7600902|142.3812247 unknown
InChI: InChI=1S/C14H15F7O2/c1-10(2)6-4-5-11(10,3)8(22)7(6)9(23)12(15,16)13(17,18)14(19,20)21/h6-7H,4-5H2,1-3H3
charge 0 multiplicity 1
38 atoms
F  1.58681 0.907011 1.56278
F  2.017503 2.349282 -0.159504
F  4.180645 0.839467 0.397385
F  3.268198 0.189497 -1.591038
F  1.833229 -1.901616 0.016471
F  3.294116 -1.384691 1.678679
F  4.075075 -2.035111 -0.34278
O  -1.232047 -2.008787 -1.082906
O  0.410217 0.755303 -1.847836
C  -2.985473 0.258366 1.049697
C  -3.067331 -0.47006 -0.353179
C  -1.758685 1.16395 0.634602
C  -0.698358 0.063977 0.223377
C  -3.108176 0.751341 -1.358432
C  -2.268697 1.870306 -0.652298
C  -1.623207 -0.975785 -0.505162
C  -4.246821 1.081206 1.403262
C  -2.707905 -0.704468 2.232194
C  -4.134901 -1.536023 -0.579281
C  0.443054 0.568022 -0.611713
C  1.762742 0.985037 0.14295
C  3.071329 0.187981 -0.195006
C  3.078843 -1.302591 0.299488
H  -1.386683 1.838278 1.422696
H  -0.303026 -0.401003 1.143181
H  -4.159981 1.050548 -1.513457
H  -2.694235 0.476388 -2.343637
H  -1.451944 2.239622 -1.292492
H  -2.888408 2.743282 -0.387121
H  -4.550879 1.786975 0.614204
H  -5.09948 0.403918 1.593086
H  -4.074165 1.663226 2.328197
H  -3.628953 -1.253509 2.499166
H  -1.936728 -1.464935 2.01696
H  -2.388336 -0.139215 3.127347
H  -4.000846 -2.014416 -1.56557
H  -4.073763 -2.33556 0.180661
H  -5.147636 -1.095613 -0.543268
