program: Gaussian 09
title: 000104042
version: EM64L-G09RevD.01
frameworkgroup: C1[X(C18H20NO4S)]
method: RPBEPBE
basis: SDD
operation: Freq
keyword: #p
keyword: freq=noraman
keyword: PBEPBE/SDD
title: #p freq=noraman PBEPBE/SDD
converged: YES YES NO NO
title: Mulliken charges:
elementType: S O O O O N C C C C C C C C C C C C C C C C C C H H H H H H H H H H H H H H H H H H H H
charge: 1.029772 -0.183162 -0.600630 -0.529103 -0.469244 -0.205098 -0.415456 -0.442578 -0.288409 0.313764 0.403063 0.162511 -0.667295 -0.519342 0.420164 -0.331930 -0.780469 -0.370436 0.320208 -0.379526 -0.383406 -0.223998 -0.229016 -0.222215 0.286819 0.262030 0.317655 0.263707 0.322312 0.247865 0.284999 0.246712 0.274554 0.284822 0.278563 0.334500 0.291740 0.277638 0.402459 0.243761 0.228988 0.247549 0.242959 0.252195
chargesum: 1.00000
title: Mulliken charges with hydrogens summed into heavy atoms:
elementType: S O O O O N C C C C C C C C C C C C C C C C C C
charge: 1.029772 -0.183162 -0.198170 -0.529103 -0.469244 -0.205098 0.133394 0.138783 0.033904 0.313764 0.403063 0.162511 0.112282 -0.244787 0.420164 -0.047107 0.124333 -0.092798 0.320208 -0.135765 -0.154418 0.023551 0.013943 0.029980
polarizability: 3.63399431e+02 3.93892417e+01 2.61718736e+02 1.80938607e+00 -1.02015202e+00 1.38237391e+02
1716.lowfreq: -0.0020 -0.0018 -0.0011 0.8287 5.3563 6.4981 15.9994 30.1789 40.2382
frequency: 15.9461 30.1213 40.2281 51.5467 58.9288 79.5549 86.9828 110.5252 137.3215 150.3153 168.3373 169.7752 178.4436 194.5034 203.8352 224.9047 240.2051 248.3563 255.6327 269.0791 289.0444 307.3910 322.8298 328.7034 343.3111 381.9378 393.0862 402.2090 407.0260 432.6004 459.5797 477.3890 495.7897 514.8403 541.4208 542.5411 609.6535 612.1197 621.1482 647.9767 668.5383 700.9443 705.9885 729.7773 756.7661 765.5956 778.3765 829.8742 832.9168 837.6154 848.8604 876.7498 900.6897 906.0427 927.9141 951.4979 972.1309 972.6863 978.8316 989.8335 997.8360 1007.1596 1008.6632 1019.6838 1032.4739 1035.7344 1045.0720 1048.6145 1085.7721 1091.0296 1109.1112 1127.8776 1140.5779 1172.2025 1181.8564 1182.2163 1199.6055 1217.9006 1258.4435 1268.7453 1275.8415 1297.9972 1313.2027 1318.5549 1344.8128 1362.9685 1372.7273 1384.9532 1399.0159 1405.4480 1418.6674 1433.7478 1440.5494 1444.2607 1453.5562 1458.4029 1461.4012 1466.8335 1474.4680 1490.1923 1502.2845 1535.5317 1583.6962 1607.8819 1616.1512 1626.6236 2957.5744 2992.5473 2998.7108 3028.5077 3039.8905 3051.6810 3071.6855 3087.2788 3092.7405 3111.3502 3123.7649 3124.9893 3135.2345 3149.0531 3160.2511 3166.4114 3169.5349 3176.8034 3194.8471 3490.2338
redmass: 5.6821 5.8756 4.3547 5.2787 5.5932 4.1855 7.0478 4.6674 3.4395 3.4732 1.2073 5.6420 2.3676 2.6908 1.5610 4.0966 3.2384 3.2981 5.0316 4.2847 2.7091 2.6264 2.1370 3.9829 4.6585 4.3969 4.1139 2.9519 3.7723 3.4810 4.6037 3.5409 3.5493 5.9823 4.2263 9.0328 5.4797 5.1525 5.0319 4.9786 5.3240 1.8232 5.3522 4.0692 2.0235 1.6448 2.5405 4.9467 8.0890 1.4824 1.3013 1.5286 2.5910 2.2871 1.4195 4.9167 1.3657 1.5238 1.5058 4.3748 2.0231 2.0139 1.7288 2.3534 1.5621 1.8445 1.5911 1.7678 2.6205 1.6234 2.3989 2.1838 2.3421 1.7763 1.3098 1.1337 1.1421 2.0851 1.4863 1.7519 1.2794 1.8496 1.3629 1.6059 3.4787 1.4479 3.3937 8.1163 1.3045 1.2183 1.1961 3.0519 1.1073 2.3953 1.1492 1.0724 1.4932 1.4035 1.0540 1.3397 2.1637 4.7158 5.7573 6.2052 7.5669 8.6121 1.0445 1.0396 1.0588 1.0615 1.0946 1.0996 1.0903 1.0966 1.1059 1.1010 1.0959 1.0883 1.0878 1.0907 1.0957 1.0925 1.0908 1.1015 1.0976 1.0667
irintensity: 3.2783 1.3971 0.4162 0.9725 0.3034 0.4232 8.4613 0.4891 0.5794 1.2520 0.5826 0.7843 3.7088 3.3478 9.3362 1.2792 21.1780 7.8771 3.9473 1.0239 2.8581 75.5147 49.7252 17.4252 3.1182 9.1977 8.5106 3.1920 4.6755 2.4574 7.2181 11.1838 3.0040 3.2299 17.7015 103.0423 10.4405 0.2920 2.4793 11.7466 4.4350 44.0463 1.6572 0.2880 14.6761 59.5792 42.4207 14.4415 41.5151 30.5276 1.6013 14.1821 2.6827 6.3977 0.6038 107.9310 0.3967 13.1734 1.9263 3.1685 9.4228 1.3463 1.0343 5.3474 79.4930 6.6856 1.0151 23.3742 2.4485 8.6501 24.9445 4.5810 4.3733 21.0725 5.0916 1.6571 5.4866 21.5213 5.2067 12.9524 1.5358 48.2137 0.1829 10.4254 76.0986 10.8465 23.8730 14.7976 1.2422 28.4804 35.0996 24.9244 4.3130 15.7250 35.0273 32.4463 35.3216 54.0488 14.1297 14.7758 14.5213 28.8368 2.1820 49.8172 21.6803 30.2660 101.0146 0.2340 8.9895 6.3552 38.1628 0.9881 0.3586 2.7267 5.5249 3.7953 5.9894 9.5645 4.9931 2.5173 16.9592 2.2637 0.4240 14.2117 1.0668 79.2862
temp: 298.150 k
press: 1.00000 atm
elementType: 16 8 8 8 8 7 6 6 6 6 6 6 6 6 6 6 6 6 6 6 6 6 6 6 1 1 1 1 1 1 1 1 1 1 1 1 1 1 1 1 1 1 1 1
symmnumber: 1
zpe: 903301.4 jmol-1
zpe.correction: 0.344049 hartree
zpe.thermalcorrener: 0.367648 hartree
zpe.thermalcorrenthalpy: 0.368592 hartree
zpe.thermalcorrgfe: 0.289861 hartree
zpe.sumelectzpe: -1449.488813 hartree
zpe.sumelectthermal: -1449.465214 hartree
zpe.sumelectthermalent: -1449.464270 hartree
zpe.sumelectthermalfe: -1449.543001 hartree
dipole: -2.3164 1.0978 1.7858
dipole: 3.1242
quadrupole: -100.5899 -109.6281 -145.1795
quadrupole: 3.1153 11.1617 3.0814
quadrupole: 17.8759 8.8377 -26.7137 3.1153 11.1617 3.0814
hfenergy: -1449.8328619 hartree
pointgroup: C01 [X(C18H20N1O4S1)]
dipole: 0.9287212 0.4819865 -0.644945 debye
polarizability: 359.2380025|-43.9337843|263.027495|-5.3570907|18.9408424|141.0900611 unknown
InChI: InChI=1S/C18H20NO4S/c1-13(24(20,21)22)10-11-19-14(2)23-18-9-8-16(12-17(18)19)15-6-4-3-5-7-15/h3-9,12-13,20H,10-11H2,1-2H3
charge 1 multiplicity 1
44 atoms
S  -5.123936 -0.481714 -0.275104
O  -0.438254 3.285295 0.608133
O  -4.907496 0.177311 -2.018259
O  -4.849352 0.76314 0.733752
O  -6.493389 -1.320411 -0.160932
N  -1.069459 1.368438 -0.357662
C  -2.322702 -0.76102 0.090137
C  -1.929616 0.316718 -0.954769
C  -3.479953 -1.65213 -0.368773
C  0.335462 1.249865 -0.126502
C  -1.494809 2.578174 0.088385
C  0.725923 2.465533 0.47539
C  -3.774187 -2.872803 0.49545
C  1.268189 0.240444 -0.409876
C  2.624587 0.488653 -0.056762
C  2.043337 2.752754 0.838544
C  -2.850283 3.16883 0.060737
C  2.980091 1.735619 0.561445
C  3.669937 -0.537031 -0.323745
C  4.984936 -0.149017 -0.702681
C  3.373808 -1.924063 -0.213117
C  5.972524 -1.120443 -0.966561
C  4.363013 -2.894604 -0.472977
C  5.666216 -2.496331 -0.852478
H  -2.600285 -0.275309 1.04479
H  -1.463136 -1.424559 0.30532
H  -2.825441 0.798649 -1.380878
H  -1.370674 -0.130959 -1.795023
H  -3.486803 -1.869743 -1.450239
H  -3.791933 -2.628479 1.571337
H  -4.735692 -3.34086 0.225259
H  -2.979884 -3.623981 0.325146
H  0.989635 -0.687293 -0.917141
H  2.328852 3.694337 1.31231
H  -3.123887 3.476501 -0.967238
H  -3.616564 2.446085 0.404231
H  -2.872753 4.063535 0.700894
H  4.021891 1.894337 0.854268
H  -5.792102 0.49785 -2.358373
H  5.229949 0.911578 -0.829384
H  2.381147 -2.247444 0.122589
H  6.976708 -0.805808 -1.268257
H  4.12466 -3.958007 -0.367516
H  6.434828 -3.249438 -1.053973
