program: Gaussian 09
title: 000103980
version: EM64L-G09RevD.01
frameworkgroup: C1[X(C19H20BrN3O2)]
method: RPBEPBE
basis: SDD
operation: Freq
keyword: #p
keyword: freq=noraman
keyword: PBEPBE/SDD
title: #p freq=noraman PBEPBE/SDD
converged: NO YES NO NO
title: Mulliken charges:
elementType: Br O O N N N C C C C C C C C C C C C C C C C C C C H H H H H H H H H H H H H H H H H H H H
charge: 0.023105 -0.326872 -0.310725 -0.404301 -0.103049 -0.668686 0.120584 0.260004 0.165557 -0.352267 -0.475565 -0.339477 -0.160380 0.296769 0.274860 -0.160210 0.491976 -0.319178 -0.555349 -0.392796 -0.389102 -0.617648 -0.610198 -0.230871 -0.231870 0.212076 0.219104 0.219994 0.246333 0.379833 0.196032 0.226208 0.273051 0.291307 0.292190 0.222635 0.191446 0.225687 0.190396 0.233382 0.220224 0.234373 0.234980 0.317189 0.389248
chargesum: 0.00000
title: Mulliken charges with hydrogens summed into heavy atoms:
elementType: Br O O N N N C C C C C C C C C C C C C C C C C C C
charge: 0.023105 -0.326872 -0.310725 -0.024469 -0.103049 0.037751 0.120584 0.260004 0.165557 0.114060 -0.044385 0.082763 -0.160380 0.296769 0.274860 -0.160210 0.491976 -0.046127 -0.555349 -0.101488 -0.096912 0.022121 0.033804 0.003501 0.003111
polarizability: 3.81450845e+02 6.00175473e+01 3.73573129e+02 -3.61194690e+01 1.41671755e+01 1.40566179e+02
1716.lowfreq: -1.6552 -0.0006 -0.0005 -0.0005 2.8157 5.7490 15.9651 21.6049 36.1840
frequency: 15.5520 21.3765 36.1752 47.9302 58.4537 82.8487 102.5160 106.6892 127.3969 148.6877 149.7924 185.0772 197.1309 212.8909 221.0976 228.1278 238.4393 262.4912 270.6366 299.8794 320.8828 342.2063 364.4184 382.1530 389.9042 397.8826 410.7357 425.0985 426.4992 437.4194 450.9245 478.0518 499.3003 512.7646 520.1756 540.2621 568.3215 616.6566 647.0046 653.0763 670.8004 707.0811 725.2022 736.8269 741.2946 773.0884 805.3631 830.4808 843.5245 855.6622 857.9699 866.5168 871.8859 882.2057 890.7079 930.8722 942.6922 981.0315 995.5953 1008.2884 1011.9887 1024.8154 1036.0771 1046.0459 1069.2926 1081.9582 1086.8503 1095.7032 1106.3078 1134.4002 1138.5630 1167.2370 1172.1802 1180.5620 1214.9504 1246.0999 1257.1641 1265.6193 1272.3345 1289.0110 1298.2083 1316.6201 1346.7562 1347.6962 1356.4734 1370.6885 1372.8484 1374.5984 1404.7421 1409.5466 1420.5277 1441.3890 1451.0749 1459.3844 1460.9968 1463.5693 1469.9691 1471.0117 1476.1096 1477.5593 1479.0362 1486.7436 1503.2260 1530.6169 1554.0409 1572.0825 1593.3783 1608.9193 1628.2099 2850.6540 2852.0596 2868.8309 2940.5014 2986.7156 3002.4517 3018.9964 3022.9492 3026.5346 3053.2595 3077.1209 3080.8485 3098.0905 3131.2474 3149.1290 3163.8295 3170.9782 3182.4263 3194.3922 3595.0354
redmass: 4.5140 4.6755 8.5618 2.8907 4.3883 3.5968 4.5110 7.7649 6.8554 3.7377 5.1189 4.2310 2.8720 13.1981 1.4096 2.6211 1.3011 4.5723 4.5567 3.2257 2.8243 3.5255 3.4130 6.5468 2.3331 6.3588 2.1347 3.9098 5.4012 4.9690 12.3288 3.9274 2.7920 5.7751 3.6714 1.3556 4.8383 4.7930 5.9160 6.4503 5.4848 6.5658 2.7547 2.3893 4.1849 6.8434 1.8080 1.9423 1.2553 1.9077 1.3860 1.4932 5.0169 5.2092 2.6163 1.9028 2.8287 2.4414 1.3872 2.5701 1.3568 2.3557 1.5336 2.0235 1.7933 1.7963 2.1643 1.6394 2.4530 1.9299 1.6441 1.3462 1.6222 2.0257 1.2467 1.6023 2.1150 2.2535 1.8513 1.5757 1.4107 2.9076 2.4417 1.8053 1.5869 2.1248 1.9717 4.5042 9.0107 3.5608 1.1413 1.1576 2.9593 1.1487 3.0446 1.0552 1.1382 1.3408 2.3065 1.0676 1.0738 1.0559 5.8691 6.6040 2.4568 1.7394 3.8742 6.4811 6.6434 1.0569 1.0667 1.0609 1.0588 1.0775 1.0861 1.0733 1.0766 1.0853 1.0987 1.1008 1.1006 1.0830 1.0862 1.0909 1.0942 1.0992 1.0914 1.0656 1.0876
irintensity: 0.0445 0.0884 0.5674 0.8697 1.2038 0.3429 0.2683 3.4571 0.3742 1.4853 0.0721 0.3214 3.9426 0.7119 0.2654 0.1866 2.3504 1.1462 0.2595 0.4266 15.9342 7.3837 2.7237 3.6739 1.7014 1.2897 1.3763 3.1845 16.9388 2.8394 1.7251 23.4650 10.3069 6.6362 5.0437 122.5692 8.8479 11.6614 11.7449 13.7483 0.7798 3.7494 8.5163 47.3361 12.0103 23.3941 56.9872 11.2313 107.3289 26.6148 95.6602 6.8494 3.2946 24.6296 2.1908 0.0418 4.3845 32.8882 5.4014 51.9004 0.0068 62.6896 12.4475 60.3912 8.6204 9.6626 7.6642 8.0643 15.5683 5.8254 8.7672 6.8159 4.0254 8.1126 25.4207 0.3821 6.4875 3.2069 24.4085 88.5967 84.4330 437.1214 97.0795 92.3203 0.8720 16.0975 34.1897 8.4861 11.6222 86.3814 3.7857 7.4553 5.4677 0.4600 13.5995 10.3676 7.7081 80.9500 23.8524 20.2624 32.2652 11.2302 0.6247 517.4090 63.9154 213.4514 76.4052 2.4081 58.7615 76.4987 46.4836 302.9096 59.3204 6.4355 52.7538 35.1290 34.3331 16.6181 57.2913 26.6336 51.4524 18.6006 4.9249 17.3926 1.9733 34.7169 0.6747 40.5291 104.0632
temp: 298.150 k
press: 1.00000 atm
elementType: 35 8 8 7 7 7 6 6 6 6 6 6 6 6 6 6 6 6 6 6 6 6 6 6 6 1 1 1 1 1 1 1 1 1 1 1 1 1 1 1 1 1 1 1 1
symmnumber: 1
zpe: 932030.0 jmol-1
zpe.correction: 0.354991 hartree
zpe.thermalcorrener: 0.378117 hartree
zpe.thermalcorrenthalpy: 0.379061 hartree
zpe.thermalcorrgfe: 0.300424 hartree
zpe.sumelectzpe: -1062.416064 hartree
zpe.sumelectthermal: -1062.392938 hartree
zpe.sumelectthermalent: -1062.391994 hartree
zpe.sumelectthermalfe: -1062.470631 hartree
dipole: 3.4241 -0.3867 -0.1012
dipole: 3.4474
quadrupole: -139.0325 -145.7554 -158.2987
quadrupole: 1.3987 -2.3392 -0.9696
quadrupole: 8.6630 1.9401 -10.6031 1.3987 -2.3392 -0.9696
hfenergy: -1062.7710553 hartree
pointgroup: C01 [X(C19H20Br1N3O2)]
dipole: 1.3507215 0.1178203 0.0348433 debye
polarizability: 379.469507|-62.8331511|371.7553096|27.8866021|35.6618849|144.3653362 unknown
InChI: InChI=1S/C19H20BrN3O2/c1-23(2)9-5-8-22-14-10-13(20)17(21)16-15(14)18(24)11-6-3-4-7-12(11)19(16)25/h3-4,6-7,10,22H,5,8-9,21H2,1-2H3
charge 0 multiplicity 1
45 atoms
Br 0.637757 -4.933673 -0.480507
O  0.174144 1.936424 0.959046
O  -3.796406 -1.527017 -0.776047
N  1.902519 0.026525 0.962976
N  5.0043 1.006911 -0.914393
N  -2.13744 -3.487747 -0.819011
C  -0.437582 -0.317992 0.310845
C  0.905352 -0.806421 0.526844
C  -1.469226 -1.22471 -0.144127
C  3.298149 -0.369374 1.195187
C  4.16843 0.875154 1.460281
C  4.350196 1.745954 0.192827
C  -0.735801 1.094203 0.554192
C  -2.119053 1.577161 0.32966
C  -3.137897 0.686683 -0.117049
C  -2.841745 -0.744817 -0.370554
C  -1.174128 -2.615384 -0.388932
C  1.183397 -2.197932 0.276387
C  0.183346 -3.048357 -0.160007
C  -2.431889 2.941865 0.562735
C  -4.455197 1.172663 -0.324429
C  6.455968 0.823621 -0.713378
C  4.700039 1.575598 -2.243988
C  -3.740503 3.415188 0.35485
C  -4.75662 2.526978 -0.0906
H  5.152343 0.540699 1.839045
H  3.717316 1.494404 2.261474
H  3.361718 -1.072342 2.053162
H  3.710247 -0.874986 0.297745
H  1.572531 1.00733 1.121025
H  4.915346 2.673984 0.464333
H  3.354288 2.072184 -0.161506
H  2.192701 -2.583242 0.433752
H  -1.628664 3.600777 0.905904
H  -5.215654 0.464933 -0.667833
H  6.651919 0.305849 0.241877
H  7.021227 1.790836 -0.702669
H  6.86685 0.195867 -1.524565
H  5.10794 2.607727 -2.393537
H  3.606116 1.614608 -2.39009
H  5.126494 0.926233 -3.030252
H  -3.977579 4.469324 0.536631
H  -5.774844 2.897919 -0.251519
H  -1.907114 -4.465989 -0.987566
H  -3.083288 -3.077518 -0.951718
