program: Gaussian 09
title: 000103942
version: EM64L-G09RevD.01
frameworkgroup: C1[X(C19H16O3)]
method: RPBEPBE
basis: SDD
operation: Freq
keyword: #pfreq=noraman
keyword: PBEPBE/SDD
title: #p freq=noraman PBEPBE/SDD
converged: YES YES NO NO
title: Mulliken charges:
elementType: O O O C C C C C C C C C C C C C C C C C C C H H H H H H H H H H H H H H H H
charge: -0.440636 -0.435618 -0.436619 -0.471659 0.310348 0.458749 0.490129 0.113461 -0.349801 -0.402326 -0.406776 -0.360936 -0.360773 -0.405043 -0.394570 -0.394814 -0.365889 -0.367354 -0.266616 0.277894 0.277729 -0.216243 0.248622 0.258814 0.236874 0.232809 0.257838 0.256239 0.214775 0.216571 0.215737 0.248794 0.247660 0.226887 0.225911 0.356760 0.351694 0.351378
chargesum: 0.00000
title: Mulliken charges with hydrogens summed into heavy atoms:
elementType: O O O C C C C C C C C C C C C C C C C C C C
charge: -0.083876 -0.083924 -0.085241 -0.223037 0.310348 0.458749 0.490129 0.113461 -0.090987 -0.165452 -0.173967 -0.103098 -0.104534 -0.190269 -0.177999 -0.179077 -0.117095 -0.119693 -0.039729 0.277894 0.277729 0.009668
polarizability: 2.41075728e+02 3.68040253e+00 2.23396807e+02 -3.46822390e+00 -3.30247203e+00 1.73857219e+02
1716.lowfreq: -8.0216 0.0002 0.0007 0.0009 3.7591 7.4801 23.7920 31.6644 39.2666
frequency: 23.2179 31.6273 39.2346 42.5979 51.1967 66.4529 146.2900 155.8172 164.7514 203.8927 234.6514 238.8439 285.7885 334.9544 341.4036 344.3115 350.5223 352.8446 389.9207 398.4552 409.4318 411.9596 440.5493 450.2348 495.4786 510.6674 521.7660 538.1007 565.9269 570.9688 620.0868 633.8741 639.1100 705.3726 721.6167 727.3722 754.6318 775.0705 786.8748 790.0558 807.0522 809.9104 818.1618 833.8690 838.1955 856.7024 865.0422 871.8013 934.9398 936.7832 940.6526 967.0956 972.7605 979.2029 1004.4093 1004.6355 1040.2459 1068.1663 1101.3685 1105.1420 1142.7455 1144.8434 1150.4783 1166.0181 1172.2328 1178.9185 1181.6789 1194.7721 1205.6172 1240.9026 1244.9489 1245.7720 1264.2012 1269.3094 1307.0784 1328.4131 1332.4536 1383.5916 1394.4623 1396.9662 1422.6576 1427.2328 1437.1092 1490.9547 1499.4600 1501.3117 1595.7321 1599.1616 1601.4932 1610.7088 1624.1056 1626.5427 2995.6417 3106.9610 3107.4610 3109.2524 3132.1064 3133.1216 3134.4082 3136.8843 3141.7957 3144.6606 3164.9442 3167.7698 3169.1993 3581.4866 3582.0965 3584.3123
redmass: 3.8759 4.2722 4.1085 7.0458 5.9048 5.4952 6.0362 5.9256 4.9724 7.2112 5.5081 5.7245 4.1066 3.2637 1.2008 1.2793 5.3864 1.1338 4.0644 3.8220 2.9249 2.9341 4.2428 3.6106 3.9755 3.1745 4.2474 4.2184 4.1304 4.4698 5.6866 7.0130 6.6583 3.7221 3.8474 3.4820 1.4282 3.6938 2.7023 4.2766 1.5597 2.5503 2.0651 1.6933 1.6531 1.8271 3.2810 3.4661 1.3963 1.4136 1.3801 1.3579 1.3429 1.3265 2.8159 2.8567 2.1786 2.5024 1.4383 1.4198 1.3924 1.4155 1.2720 1.7209 1.3417 1.1132 1.1169 1.9450 2.1908 2.5420 2.7698 2.8060 1.6239 1.6300 1.3759 1.3101 1.3123 5.7543 5.8247 5.8824 2.9873 2.6381 2.3270 2.5977 2.6857 2.7041 6.5380 6.2842 6.3842 6.7111 6.3557 6.4338 1.0824 1.0878 1.0874 1.0885 1.0870 1.0961 1.0939 1.0910 1.0887 1.0931 1.1003 1.0955 1.0958 1.0660 1.0660 1.0660
irintensity: 1.2083 0.7254 0.8024 0.0691 0.6791 1.3441 0.1428 0.4131 0.5265 1.4773 0.6398 0.2948 10.9964 19.2116 131.0216 98.7715 7.7132 133.6240 10.3962 25.1378 0.3972 0.2771 7.8133 1.0040 10.2941 23.3025 10.6283 22.4720 13.4982 30.6437 3.8943 2.0894 2.4554 3.3968 1.2146 4.3276 81.2715 7.7453 11.9721 23.8743 30.7467 34.2173 2.9918 34.3232 14.3547 17.0340 12.3576 12.1315 0.6229 0.9181 1.1897 0.0406 0.0168 0.1225 8.0107 5.7665 11.0316 95.2565 49.9583 25.5684 268.9160 219.5820 65.2122 18.2004 1.8209 15.9788 8.0689 12.2810 0.7874 28.4415 19.5563 36.2086 4.2058 21.3968 22.9820 14.6489 18.3932 11.4219 17.7900 8.9299 4.6207 25.5439 32.6903 32.0987 151.1397 67.7090 14.3002 6.8264 17.9522 5.3989 46.4810 17.9526 4.5599 24.4002 18.6499 15.2171 3.5007 18.7511 18.9323 3.7681 4.0817 17.4514 25.7295 6.8806 7.1437 45.0306 36.0473 28.0423
temp: 298.150 k
press: 1.00000 atm
elementType: 8 8 8 6 6 6 6 6 6 6 6 6 6 6 6 6 6 6 6 6 6 6 1 1 1 1 1 1 1 1 1 1 1 1 1 1 1 1
symmnumber: 1
zpe: 776352.7 jmol-1
zpe.correction: 0.295697 hartree
zpe.thermalcorrener: 0.314775 hartree
zpe.thermalcorrenthalpy: 0.315719 hartree
zpe.thermalcorrgfe: 0.246593 hartree
zpe.sumelectzpe: -957.745289 hartree
zpe.sumelectthermal: -957.726211 hartree
zpe.sumelectthermalent: -957.725267 hartree
zpe.sumelectthermalfe: -957.794393 hartree
dipole: 0.0718 1.8881 2.8087
dipole: 3.3850
quadrupole: -116.2035 -113.8282 -121.8639
quadrupole: 2.2739 -2.3624 -4.4089
quadrupole: 1.0951 3.4704 -4.5654 2.2739 -2.3624 -4.4089
hfenergy: -958.0409858 hartree
pointgroup: C01 [X(C19H16O3)]
dipole: 0.0094911 0.7251899 1.1169768 debye
polarizability: 240.7853324|4.2878943|223.7524071|-3.6103|-2.6184147|173.7920146 unknown
InChI: InChI=1S/C19H16O3/c20-15-9-5-13(6-10-15)19(14-7-11-16(21)12-8-14)17-3-1-2-4-18(17)22/h1-12,19-22H
charge 0 multiplicity 1
38 atoms
O  -1.672795 2.126209 1.950704
O  5.225126 -1.979053 -0.469308
O  -4.317752 -3.308665 -0.73535
C  0.01337 0.242382 0.737597
C  -0.142341 1.653278 0.151979
C  1.386952 -0.374018 0.418641
C  -1.158583 -0.67658 0.351634
C  -1.024212 2.574265 0.781329
C  0.530697 2.086222 -1.013738
C  2.520093 0.045806 1.159997
C  -1.548098 -1.715968 1.231567
C  1.581467 -1.33198 -0.608767
C  -1.850904 -0.550961 -0.87934
C  -1.228621 3.874198 0.265376
C  3.806917 -0.466078 0.891997
C  -2.591317 -2.606672 0.901839
C  2.860394 -1.855084 -0.892107
C  -2.896226 -1.431297 -1.227318
C  0.335202 3.381693 -1.547345
C  3.974531 -1.419926 -0.141361
C  -3.265214 -2.461867 -0.335047
C  -0.549136 4.276734 -0.906009
H  -0.039641 0.361549 1.837997
H  1.227905 1.396686 -1.502101
H  2.394997 0.789204 1.956946
H  -1.02931 -1.83102 2.190965
H  0.720815 -1.686119 -1.186149
H  -1.580467 0.254091 -1.571292
H  -1.912677 4.568023 0.772419
H  4.66914 -0.128039 1.482333
H  -2.878768 -3.402238 1.602234
H  3.010926 -2.597112 -1.681958
H  -3.433878 -1.333328 -2.175208
H  0.870147 3.687785 -2.452421
H  -0.708932 5.283647 -1.306937
H  -2.288576 2.818037 2.297311
H  5.936039 -1.610166 0.111367
H  -4.495567 -3.99474 -0.045178
