program: Gaussian 09
title: 000103913
version: EM64L-G09RevD.01
frameworkgroup: C1[X(C6H6O8S2)]
method: RPBEPBE
basis: SDD
operation: Freq
keyword: #pfreq=noraman
keyword: PBEPBE/SDD
title: #p freq=noraman PBEPBE/SDD
converged: YES YES NO NO
title: Mulliken charges:
elementType: S S O O O O O O O O C C C C C C H H H H H H
charge: 1.021327 0.996134 -0.448062 -0.413712 -0.535411 -0.540072 -0.498950 -0.475352 -0.456077 -0.530059 -0.183578 -0.135314 0.412370 -0.405407 -0.366735 0.361224 0.298756 0.307041 0.406163 0.409777 0.398521 0.377415
chargesum: 0.00000
title: Mulliken charges with hydrogens summed into heavy atoms:
elementType: S S O O O O O O O O C C C C C C
charge: 1.021327 0.996134 -0.041899 -0.036297 -0.125634 -0.141550 -0.498950 -0.475352 -0.456077 -0.530059 -0.183578 -0.135314 0.412370 -0.106652 -0.059694 0.361224
polarizability: 1.96138329e+02 1.51813599e+00 1.61233416e+02 9.97191112e-01 -1.34625485e+00 9.33259330e+01
1716.lowfreq: -5.7230 -3.9976 -0.0020 -0.0016 0.0011 2.2118 33.3445 49.8136 68.8142
frequency: 33.3346 49.7797 68.8117 108.8599 114.8418 143.4597 162.9220 183.4726 204.0813 207.3714 222.0088 232.9438 274.6518 288.3542 309.4994 314.2845 326.3440 337.2344 339.3914 365.1242 371.8560 406.5462 435.7851 443.7007 464.4356 512.6203 553.7860 564.6501 584.1286 587.8133 707.6146 720.8692 763.4975 785.8979 804.9301 845.2023 882.4480 887.2158 888.6607 946.5811 968.8144 1016.0430 1062.5020 1134.9540 1153.4339 1167.1839 1215.9022 1270.9639 1343.8139 1413.4520 1431.1513 1494.1206 1565.2593 1633.6571 2908.4060 3129.5419 3171.0440 3364.8326 3469.3178 3589.0178
redmass: 8.9929 11.2680 10.9187 8.9067 7.4629 6.5054 9.3811 3.4590 3.4123 7.5918 6.0350 5.1281 3.0243 6.2972 7.5104 10.6173 9.6820 2.5910 1.5778 5.8436 4.4229 2.9159 7.7791 2.4681 10.1445 6.4939 10.4160 6.8493 4.4868 4.5363 8.2116 5.8012 7.2579 4.7487 1.2956 14.6129 1.6135 6.7331 1.5029 10.3597 9.1738 2.8382 1.2055 1.4134 1.2801 1.5991 1.7598 4.6044 2.0762 2.8888 3.4022 2.8443 4.8037 7.2536 1.0697 1.0924 1.0931 1.0653 1.0662 1.0667
irintensity: 1.2956 2.6668 1.7301 5.2579 3.5410 13.3261 1.3560 29.1992 9.4337 3.5103 14.7323 2.7911 40.5369 12.4272 22.2374 12.2737 10.7140 50.4663 114.4286 35.7434 27.8668 7.7635 98.7612 157.3742 3.2073 53.0770 205.5405 38.1334 39.8337 19.3450 23.9563 48.4495 53.3536 33.5425 128.8600 122.1332 17.2529 3.0014 10.0668 112.3781 75.7918 2.6323 80.9231 267.1473 107.7936 35.0486 11.0052 17.2461 22.3349 133.2585 219.2953 56.6166 14.6983 20.7837 492.4982 12.8441 9.9972 58.2524 75.0088 83.7857
temp: 298.150 k
press: 1.00000 atm
elementType: 16 16 8 8 8 8 8 8 8 8 6 6 6 6 6 6 1 1 1 1 1 1
symmnumber: 1
zpe: 328664.5 jmol-1
zpe.correction: 0.125182 hartree
zpe.thermalcorrener: 0.142456 hartree
zpe.thermalcorrenthalpy: 0.143401 hartree
zpe.thermalcorrgfe: 0.080292 hartree
zpe.sumelectzpe: -1628.564593 hartree
zpe.sumelectthermal: -1628.547318 hartree
zpe.sumelectthermalent: -1628.546374 hartree
zpe.sumelectthermalfe: -1628.609482 hartree
dipole: -4.3502 3.4116 0.8655
dipole: 5.5957
quadrupole: -127.5067 -98.0135 -115.7884
quadrupole: 12.3075 -9.3774 0.8420
quadrupole: -13.7372 15.7561 -2.0189 12.3075 -9.3774 0.8420
hfenergy: -1628.6897749 hartree
pointgroup: C01 [X(C6H6O8S2)]
dipole: 1.7098256 1.2445084 -0.6119082 debye
dipolederiv: 2.0666237 0.1983907 0.0326883 0.3521336 1.319391 -0.0825633 0.0811402 -0.0382635 1.4425905 1.9416862 -0.2382397 -0.1052056 -0.2907583 1.2751169 0.056128 -0.3065669 0.1115264 1.6179745 -0.5273813 0.0545218 0.0163894 0.1035517 -1.1130264 0.1298523 0.0109019 0.1367321 -0.3321509 -0.0780522 -0.0051996 -0.0094835 0.0196965 -1.567013 0.1384315 -0.0153507 0.1533904 -0.4242847 -0.5903697 -0.0624183 -0.2142199 -0.196984 -0.6740272 0.2977706 -0.011532 0.2184835 -0.6615903 -0.6077946 -0.0042268 0.2610441 0.049104 -0.5097954 -0.1197761 0.418508 -0.1454797 -0.9155664 -0.7314174 -0.0081502 0.0177391 0.0497914 -0.5130861 -0.034604 0.0448639 -0.0613558 -0.4369651 -0.6393988 -0.07019 0.0236496 -0.156286 -0.4965685 -0.0956354 -0.0938624 -0.0751369 -0.5709152 -0.7608136 0.0191132 -0.0704519 -0.0231574 -0.4560663 -0.0796553 -0.0419484 -0.0276884 -0.4777734 -0.7754767 -0.0243262 0.0797628 0.0033075 -0.6600466 0.0965498 0.0475573 0.0208347 -0.5042299 -0.1700611 0.2237625 -0.0247197 -0.3095879 -0.168842 0.0146225 -0.014827 -0.0334247 -0.1938469 -0.1091778 -0.130606 0.0182014 0.2979902 -0.087495 -0.0000803 -0.1514358 0.0590972 -0.1669844 -0.1780761 -0.1183847 0.0279674 0.0735646 0.7191138 -0.1265928 -0.0028007 -0.1603497 0.1280395 -0.0521571 -0.3846013 0.0511764 0.3886663 -0.1993598 -0.0138358 -0.0636289 0.0480069 -0.0863494 -0.0331786 0.3437569 -0.0436924 -0.4531537 -0.1941678 0.0256429 0.0780667 0.0087711 -0.0664061 -0.306288 0.0011234 0.016838 -0.0370073 1.5418585 -0.1717964 0.0364557 -0.189069 0.115536 0.1194595 0.0733195 -0.0115458 0.0293122 0.0916495 0.0083293 -0.0050455 -0.011056 0.1617505 0.0965814 -0.0301778 0.0013438 -0.006954 0.1434242 0.0078597 -0.0079557 -0.0017549 0.1635836 0.6944316 -0.0283857 -0.0417398 -0.1130777 0.4046771 -0.0000734 0.0448415 0.0215959 0.3226791 0.3458855 0.117152 0.0795492 0.1647524 0.3514304 -0.098799 -0.0522368 -0.0310961 0.2107969 0.2003307 0.0795034 -0.1160408 0.0674181 0.3230291 0.0562635 -0.0039066 0.0059702 0.2771155 0.0946442 -0.0057371 0.0107498 -0.0123224 0.4698037 -0.0080384 0.0087622 -0.0097337 0.3969965 unknown
polarizability: 195.8635755|-2.6140151|160.4480675|-4.5390477|-7.6384903|94.3860347 unknown
InChI: InChI=1S/C6H6O8S2/c7-3-1-4(15(9,10)11)6(8)5(2-3)16(12,13)14/h1-2,7-9,12H
charge 0 multiplicity 1
22 atoms
S  -2.983865 -0.507823 0.14115
S  2.69789 -0.689085 0.097561
O  -0.254605 -1.81506 0.417346
O  0.101378 3.762245 -0.421245
O  -2.777836 -1.476948 1.683044
O  2.97854 -0.791371 -1.717494
O  -4.05176 0.651278 0.474271
O  -3.184519 -1.492943 -1.118046
O  3.911172 0.1216 0.773621
O  2.316702 -2.188844 0.651647
C  -1.286018 0.332601 0.051593
C  1.094499 0.25474 0.019003
C  -0.125109 -0.466105 0.15589
C  -1.272129 1.717694 -0.134747
C  1.172112 1.64166 -0.180611
C  -0.025737 2.386186 -0.242398
H  -2.228746 2.254669 -0.170227
H  2.134282 2.154648 -0.26962
H  0.668494 -2.252628 0.521058
H  -2.011814 -2.103061 1.485447
H  3.877978 -1.205406 -1.876181
H  -0.77571 4.218953 -0.44956
