program: Gaussian 09
title: 000103904
version: EM64L-G09RevD.01
frameworkgroup: C1[X(C14H20O)]
method: RPBEPBE
basis: SDD
operation: Freq
keyword: #pfreq=noraman
keyword: PBEPBE/SDD
title: #p freq=noraman PBEPBE/SDD
converged: YES YES NO NO
title: Mulliken charges:
elementType: O C C C C C C C C C C C C C C H H H H H H H H H H H H H H H H H H H H
charge: -0.226726 -0.148635 -0.067287 -0.077204 0.073709 -0.723958 -0.725386 -0.739043 -0.728042 0.303529 -0.367104 -0.357903 -0.247642 -0.228581 -0.229242 0.195507 0.218131 0.247069 0.253606 0.219044 0.200439 0.210990 0.227090 0.215416 0.216459 0.205266 0.225886 0.239018 0.214206 0.197761 0.228268 0.280364 0.229590 0.232518 0.232883
chargesum: 0.00000
title: Mulliken charges with hydrogens summed into heavy atoms:
elementType: O C C C C C C C C C C C C C C
charge: -0.226726 0.046873 0.150844 0.169865 0.073709 -0.050869 -0.071889 -0.091431 -0.077057 0.303529 -0.138836 -0.077539 -0.018051 0.003937 0.003641
polarizability: 1.99485663e+02 -1.23941104e+00 1.16484352e+02 -5.38744753e+00 5.18883054e+00 1.40977754e+02
1716.lowfreq: -6.5693 -0.0007 -0.0007 0.0000 4.9414 8.9435 22.1619 34.2359 67.8621
frequency: 22.0610 33.6243 67.7858 99.3269 129.6087 152.4494 160.7403 175.5585 209.8598 217.7545 232.3868 243.5087 252.1019 296.1148 316.0369 336.1049 393.7650 399.7848 419.6148 427.0780 446.3180 480.9382 491.2240 613.9960 658.5134 688.0442 700.3246 775.1053 803.6471 812.3115 853.5008 858.7007 913.5341 917.6200 924.1847 943.6913 954.7535 961.2588 979.7249 989.3419 990.3750 991.5227 1011.3427 1026.8656 1072.0678 1084.5412 1107.3987 1129.3086 1165.6262 1172.0574 1172.6180 1179.1354 1188.2989 1215.4426 1247.0484 1274.0945 1308.8364 1313.3692 1323.2483 1330.3976 1360.6761 1380.1490 1384.9957 1385.7568 1397.5169 1401.4265 1433.5422 1463.8177 1466.5448 1468.6411 1474.8089 1475.9555 1480.5522 1483.9972 1489.4699 1493.1209 1551.7323 1591.7299 1608.4937 2967.1753 2970.3400 2971.2233 2976.2924 2982.2554 2992.6744 3010.9449 3056.7162 3064.5605 3066.1930 3069.4690 3072.0652 3074.6216 3078.8910 3089.2849 3127.6801 3138.0820 3150.9004 3159.3953 3169.2863
redmass: 3.9381 3.8836 2.4506 2.5906 3.9221 5.2636 2.8948 4.1688 1.0767 1.0748 1.4887 1.1358 2.1100 2.8365 2.6394 3.3175 2.2197 2.7869 3.0318 2.9150 3.6232 3.3798 2.9567 6.4150 6.1424 4.0905 1.5907 2.4725 3.0891 2.8496 2.3534 1.2601 2.0281 1.2733 1.1970 1.4646 1.4615 1.4248 1.8625 6.0085 1.8274 1.9688 1.3483 2.0132 1.9164 1.6257 1.7667 2.1765 2.2425 1.5826 1.1818 2.1687 1.1702 2.6356 1.3472 1.4949 1.3710 1.3240 1.3389 1.3923 1.5124 1.2180 1.5130 3.5775 1.2093 1.2078 2.2501 1.0519 1.0457 1.0690 1.1059 1.9195 1.0544 1.0520 1.0506 1.0477 7.2543 6.3098 6.2595 1.0368 1.0382 1.0366 1.0786 1.0396 1.0800 1.0844 1.0982 1.0992 1.0977 1.0995 1.0985 1.0995 1.0983 1.0990 1.0850 1.0882 1.0922 1.0953 1.1008
irintensity: 0.7963 0.6723 0.1467 0.1308 1.1096 1.6276 0.7239 1.3646 0.1479 0.1531 1.5818 0.1556 1.6390 1.4272 0.4241 2.9828 0.0061 0.0056 1.0519 0.5239 0.9508 1.8521 2.0460 0.1846 13.9931 1.4031 76.9727 33.8029 10.8701 2.9074 2.2791 0.6709 9.5981 4.0058 3.8142 1.2910 5.0749 0.5744 4.0075 2.4174 11.7371 18.8723 0.9690 1.3082 1.5629 8.3987 4.6192 3.8370 3.0659 16.5687 2.0658 15.3094 33.5760 152.2263 23.1856 51.6835 1.6579 2.9161 0.4039 2.8905 23.2652 17.1285 26.5067 1.4181 19.7993 16.9162 19.1958 1.1186 3.8651 6.5300 6.6198 3.0829 13.4170 9.7038 13.7252 23.2064 95.8597 12.5001 7.3420 28.8402 28.9736 30.5272 20.3702 36.8974 11.0315 14.3916 3.0227 11.0384 91.4551 20.3624 74.4323 35.7314 52.4797 38.5114 0.1642 7.7810 17.2255 26.5097 20.1802
temp: 298.150 k
press: 1.00000 atm
elementType: 8 6 6 6 6 6 6 6 6 6 6 6 6 6 6 1 1 1 1 1 1 1 1 1 1 1 1 1 1 1 1 1 1 1 1
symmnumber: 1
zpe: 793342.9 jmol-1
zpe.correction: 0.302168 hartree
zpe.thermalcorrener: 0.318326 hartree
zpe.thermalcorrenthalpy: 0.319270 hartree
zpe.thermalcorrgfe: 0.258337 hartree
zpe.sumelectzpe: -619.565437 hartree
zpe.sumelectthermal: -619.549279 hartree
zpe.sumelectthermalent: -619.548335 hartree
zpe.sumelectthermalfe: -619.609268 hartree
dipole: 1.0974 -0.1175 -2.7189
dipole: 2.9344
quadrupole: -81.1040 -94.3353 -93.1873
quadrupole: 0.0144 1.2296 0.8524
quadrupole: 8.4382 -4.7931 -3.6451 0.0144 1.2296 0.8524
hfenergy: -619.8676051 hartree
pointgroup: C01 [X(C14H20O1)]
dipole: -0.4205144 0.2577721 1.0438182 debye
polarizability: 198.5708688|-9.3833794|116.5318039|-4.5671641|1.5707171|141.8450952 unknown
InChI: InChI=1S/C14H20O/c1-10(2)13(11(3)4)14(15)12-8-6-5-7-9-12/h5-11,13H,1-4H3
charge 0 multiplicity 1
35 atoms
O  0.439733 -0.444674 -1.853174
C  1.357026 -0.169506 0.376825
C  2.12332 1.204389 0.234053
C  2.271062 -1.429953 0.206905
C  0.193637 -0.229005 -0.624712
C  2.883657 1.360222 -1.103472
C  1.183587 2.413939 0.466477
C  3.521571 -1.370593 1.114444
C  1.466825 -2.721157 0.501373
C  -1.235519 -0.014613 -0.188739
C  -1.634896 0.133054 1.167496
C  -2.234301 0.026625 -1.202773
C  -2.99529 0.316232 1.499398
C  -3.589808 0.213816 -0.873017
C  -3.976043 0.358997 0.482156
H  0.962737 -0.193123 1.41196
H  2.868889 1.209381 1.055342
H  2.592028 -1.46285 -0.852333
H  2.192956 1.313328 -1.96311
H  3.64167 0.569455 -1.244677
H  3.404525 2.336079 -1.127361
H  0.621252 2.321852 1.414799
H  0.448106 2.520289 -0.35237
H  1.770247 3.350201 0.510917
H  4.098318 -2.310093 1.027021
H  3.235964 -1.252098 2.178382
H  4.197839 -0.539682 0.847367
H  0.592663 -2.820013 -0.16699
H  2.100444 -3.615786 0.357656
H  1.103302 -2.731379 1.547978
H  -0.893618 0.099964 1.971709
H  -1.911278 -0.093816 -2.24218
H  -3.290115 0.425292 2.548895
H  -4.346625 0.245907 -1.66455
H  -5.030967 0.502919 0.741706
