program: Gaussian 09
title: 000103883
version: EM64L-G09RevD.01
frameworkgroup: C1[X(C8H14N2O4S)]
method: RPBEPBE
basis: SDD
operation: Freq
keyword: #p
keyword: freq=noraman
keyword: PBEPBE/SDD
title: #p freq=noraman PBEPBE/SDD
converged: YES YES NO NO
title: Mulliken charges:
elementType: S O O O O N N C C C C C C C C H H H H H H H H H H H H H H
charge: 0.238758 -0.220980 -0.271092 -0.323093 -0.240068 0.102535 -0.379069 -0.043672 -0.407609 -0.285646 -0.259912 -0.532406 -0.497714 0.317821 -0.602662 0.271499 0.262321 0.229264 0.189853 0.210804 0.263157 0.274905 0.200976 0.203758 0.234862 0.330219 0.230672 0.231987 0.270534
chargesum: 0.00000
title: Mulliken charges with hydrogens summed into heavy atoms:
elementType: S O O O O N N C C C C C C C C
charge: 0.238758 -0.220980 -0.271092 -0.323093 -0.240068 0.102535 -0.048850 0.227827 0.083977 -0.285646 0.140744 0.005656 0.141881 0.317821 0.130530
polarizability: 1.92116378e+02 -1.32744399e+01 1.35020650e+02 -7.08055081e+00 -1.28686836e+01 9.10611993e+01
1716.lowfreq: -4.0380 -3.6039 -0.0019 0.0012 0.0015 6.4939 19.6140 27.4063 44.0849
frequency: 19.3345 27.3826 44.0194 64.0638 73.2617 73.8797 92.5401 97.2042 120.2992 156.2248 171.9199 193.4296 220.0713 229.4579 241.6273 283.9493 303.5347 326.2281 424.3606 462.3882 472.9227 522.8161 565.5407 568.8568 583.5953 633.0393 672.5830 682.4826 738.4821 775.6094 850.7641 864.2175 883.2796 896.0632 929.7734 980.6282 1036.9496 1041.2339 1058.2868 1084.6878 1096.0220 1118.7078 1125.0593 1131.4114 1147.4911 1158.7657 1174.2843 1184.1042 1191.2624 1241.9242 1272.4547 1282.0995 1307.4467 1329.5993 1387.3638 1430.3160 1439.1094 1449.7614 1458.4239 1458.6834 1468.1665 1472.7677 1483.7006 1492.6553 1512.3298 1580.4789 1735.1203 2915.0706 2927.7775 2972.5852 2981.2325 2999.3924 3011.4490 3020.3181 3060.1087 3063.9507 3080.4232 3104.3815 3113.3994 3138.7710 3573.1195
redmass: 5.6610 4.9425 4.1078 3.6321 2.8044 4.5027 3.4349 1.1372 2.7668 3.5981 4.4874 5.8762 1.3849 2.0289 5.2694 5.9972 5.0824 5.5776 3.6465 6.7972 6.5899 9.1454 4.8818 1.1707 5.3796 7.2514 5.5625 12.0454 4.0729 1.9338 2.7584 4.5220 3.8667 5.5092 1.4550 3.2317 4.6860 5.5510 3.7971 4.5198 1.9342 1.4460 1.2816 3.2882 1.6366 1.4977 1.1782 1.2324 2.3527 1.2658 1.1349 1.1896 1.3075 1.2896 1.3770 1.1544 1.1575 1.0880 1.0519 1.3204 1.0668 1.0713 1.0453 1.0787 1.3383 11.9675 10.1122 1.0539 1.0378 1.1029 1.0353 1.1028 1.0606 1.0602 1.1026 1.0910 1.0976 1.0973 1.0985 1.1068 1.0773
irintensity: 5.8440 3.4134 1.7908 6.3260 2.9043 0.6198 0.4266 0.2158 3.4856 2.5998 1.7237 0.8814 4.1554 8.5253 3.1133 4.9439 11.7053 10.7499 2.0585 4.7070 2.2157 2.9679 38.9471 130.1223 55.6344 37.9451 14.8156 18.1098 7.2952 9.4719 51.0134 210.3811 136.8827 96.1908 19.8863 41.5688 56.5239 372.0790 5.9928 86.7187 7.8711 0.4013 0.5876 14.3588 35.2055 7.4359 3.6164 7.6261 204.7445 5.4322 3.6803 9.1968 7.4786 2.8855 26.4596 24.2972 0.7738 1.0534 9.3356 200.9518 17.5935 5.0620 16.0687 6.2010 178.1879 66.3548 266.5535 44.7894 106.4972 48.0091 84.5375 67.4394 8.3258 48.2250 37.0771 1.8783 22.2294 30.8093 4.0317 10.3739 32.8136
temp: 298.150 k
press: 1.00000 atm
elementType: 16 8 8 8 8 7 7 6 6 6 6 6 6 6 6 1 1 1 1 1 1 1 1 1 1 1 1 1 1
symmnumber: 1
zpe: 589510.6 jmol-1
zpe.correction: 0.224533 hartree
zpe.thermalcorrener: 0.242013 hartree
zpe.thermalcorrenthalpy: 0.242957 hartree
zpe.thermalcorrgfe: 0.175854 hartree
zpe.sumelectzpe: -1120.444535 hartree
zpe.sumelectthermal: -1120.427054 hartree
zpe.sumelectthermalent: -1120.426110 hartree
zpe.sumelectthermalfe: -1120.493214 hartree
dipole: -0.7577 2.7839 -1.4708
dipole: 3.2384
quadrupole: -63.2805 -98.5001 -99.5138
quadrupole: 5.4432 -10.0520 -2.4130
quadrupole: 23.8176 -11.4019 -12.4157 5.4432 -10.0520 -2.4130
hfenergy: -1120.6690673 hartree
pointgroup: C01 [X(C8H14N2O4S1)]
dipole: -0.2936738 1.0490029 -0.6607964 debye
polarizability: 191.9859899|-14.0512378|132.9200975|-6.1570938|-16.0441024|93.2921404 unknown
InChI: InChI=1S/C8H14N2O4S/c1-9-8(11)14-10-7-6(3-4-12-2)13-5-15-7/h6,9H,3-5H2,1-2H3
charge 0 multiplicity 1
29 atoms
S  0.304513 2.337823 -0.728636
O  -1.932881 1.917411 0.771484
O  -4.219011 -1.473756 -0.704186
O  2.282974 0.241634 -0.162707
O  3.210872 -1.745924 0.820586
N  1.002046 -0.139844 0.449574
N  4.466397 -0.234747 -0.480981
C  -1.331977 0.563994 0.685266
C  -2.128842 -0.383445 -0.23489
C  0.105454 0.770824 0.18609
C  -3.547707 -0.631125 0.288201
C  -1.569573 2.68564 -0.391965
C  -5.586492 -1.807597 -0.311103
C  3.335424 -0.713914 0.138204
C  5.746154 -0.944946 -0.405609
H  -1.324685 0.190105 1.722402
H  -1.585622 -1.343732 -0.296309
H  -2.184485 0.019419 -1.263484
H  -3.516305 -1.146912 1.27564
H  -4.093876 0.328902 0.418157
H  -2.121848 2.387274 -1.300219
H  -1.701149 3.749951 -0.155668
H  -6.211958 -0.896379 -0.194863
H  -5.60826 -2.378549 0.641887
H  -5.997223 -2.432227 -1.119746
H  4.38826 0.63625 -1.006639
H  6.533649 -0.30121 0.027014
H  6.073726 -1.292942 -1.402866
H  5.610126 -1.822879 0.245465
