program: Gaussian 09
title: 000103924
version: EM64L-G09RevD.01
frameworkgroup: C1[X(C20H13NO5)]
method: RPBEPBE
basis: SDD
operation: Freq
keyword: #p
keyword: freq=noraman
keyword: PBEPBE/SDD
title: #p freq=noraman PBEPBE/SDD
converged: YES YES NO NO
title: Mulliken charges:
elementType: O O O O O N C C C C C C C C C C C C C C C C C C C C H H H H H H H H H H H H H
charge: -0.230071 -0.273755 -0.221970 -0.426405 -0.426804 -0.700104 -0.086097 0.372142 0.357810 0.353737 0.069458 0.151722 0.150415 0.089888 -0.625658 -0.330092 -0.323636 -0.365167 0.552104 -0.548576 -0.513642 -0.445084 -0.396228 -0.432912 0.314108 0.322601 0.247596 0.252150 0.250712 0.264917 0.256388 0.284019 0.225494 0.255672 0.224866 0.314988 0.317781 0.359054 0.358577
chargesum: 0.00000
title: Mulliken charges with hydrogens summed into heavy atoms:
elementType: O O O O O N C C C C C C C C C C C C C C C C C C C C
charge: -0.230071 -0.273755 -0.221970 -0.067351 -0.068228 -0.067335 -0.086097 0.372142 0.357810 0.353737 0.069458 0.151722 0.150415 0.089888 -0.378062 -0.077942 -0.072924 -0.100250 0.552104 -0.292188 -0.229623 -0.219590 -0.140555 -0.208045 0.314108 0.322601
polarizability: 2.88453086e+02 1.75939031e+00 2.75699016e+02 6.46953974e+00 5.56101538e-01 1.91506165e+02
1716.lowfreq: -0.0009 -0.0008 -0.0007 2.8405 5.1492 5.9588 32.2111 39.6947 47.9741
frequency: 32.1982 39.6803 47.9709 55.7669 95.5194 111.5024 130.6442 169.7901 186.6742 217.4899 220.7039 243.1421 270.0059 273.7781 292.3896 309.7382 319.9123 332.9949 359.0101 368.3285 373.6558 384.9444 412.5171 412.6252 431.2361 446.5843 456.4285 463.1875 467.5418 473.6344 529.4649 571.9169 588.2951 591.0645 597.5402 610.5634 624.6154 626.7571 656.6255 663.9806 684.3566 705.7578 718.7014 735.3920 743.7677 754.4525 757.7520 779.2917 803.6036 825.8163 836.5541 836.7632 859.3797 862.0392 865.2239 918.0395 920.1135 942.0596 949.3131 961.1227 970.8584 975.4008 1009.3773 1038.2611 1077.3149 1100.8963 1112.2022 1132.0089 1143.4592 1155.9448 1164.2603 1190.6070 1215.7056 1217.4716 1232.6246 1255.6159 1269.6051 1276.2471 1287.4391 1307.6733 1341.2460 1396.2227 1405.9128 1408.0295 1430.2288 1450.2622 1468.5010 1495.0109 1498.7453 1501.4675 1583.7518 1596.6805 1603.8107 1628.8323 1633.1032 1646.1164 1647.7975 1684.8157 3125.5279 3129.0944 3132.0166 3145.2706 3146.7647 3153.8988 3159.9037 3181.3175 3188.4487 3560.8499 3582.6643 3585.5734 3700.4249
redmass: 5.0530 6.5933 5.8470 7.6515 5.0312 5.9607 6.6089 6.4468 5.4323 4.6862 7.9888 9.3344 6.6357 5.4112 6.4368 6.0636 8.0420 5.3867 1.1199 1.2825 3.4410 4.0028 1.1055 3.7465 1.4343 2.1380 3.8746 4.3940 4.6407 3.3318 6.3887 7.8331 7.1265 8.9329 7.5587 4.2300 4.5051 6.0214 6.0193 3.7472 4.7400 7.9438 3.4270 7.8818 7.8523 4.2639 4.4821 3.0003 1.7790 1.8069 1.5172 1.6304 4.9819 1.6534 1.7906 4.8398 4.7109 1.3803 4.5247 1.3633 1.3525 3.0670 4.6333 1.5521 2.9685 1.9260 1.8255 1.6088 1.3466 1.4331 1.3373 1.7036 2.4471 1.8650 2.3413 2.5257 1.7843 4.0487 1.9474 2.0994 3.1175 7.3384 6.5269 6.8660 4.0183 4.0665 4.3494 3.1543 3.4413 3.5558 7.2804 8.2107 7.8224 7.0454 5.4356 5.3027 1.3135 12.2133 1.0885 1.0893 1.0915 1.0904 1.0914 1.0957 1.0964 1.0957 1.0930 1.0452 1.0661 1.0661 1.1040
irintensity: 0.3719 3.3644 0.0447 1.9856 0.9466 1.0361 0.6338 1.9605 1.9849 2.0367 3.4271 2.0805 0.1539 2.3606 3.6584 4.1648 0.9394 9.3401 125.9232 123.3402 29.9442 1.8873 13.2259 14.1384 194.1452 76.5254 10.3116 8.4978 26.8837 4.5787 6.1547 7.6686 11.4567 2.4467 6.2987 2.3436 5.8908 5.7700 13.9130 18.9426 22.2541 18.0608 2.2235 4.4388 2.0093 22.7694 1.2768 137.1494 24.9825 11.3787 36.8642 57.3665 16.7775 40.0057 25.2029 19.4696 13.8742 3.9583 28.8575 7.1689 0.0874 105.4226 175.6933 9.5059 53.7242 278.0623 19.6425 442.5349 84.1523 22.0481 25.0974 56.4304 25.2614 18.9690 22.2634 49.1852 58.9715 21.1247 21.4864 67.2787 95.4029 83.8816 4.7426 27.8212 141.8000 77.0893 7.3392 96.0371 62.8249 55.7924 24.9113 21.5032 149.5559 293.2354 252.6650 80.7562 314.7799 360.8118 12.3103 10.8425 11.4852 7.4673 0.9695 7.6309 11.2822 3.9634 0.1270 107.8195 58.5264 57.6550 24.2674
temp: 298.150 k
press: 1.00000 atm
elementType: 8 8 8 8 8 7 6 6 6 6 6 6 6 6 6 6 6 6 6 6 6 6 6 6 6 6 1 1 1 1 1 1 1 1 1 1 1 1 1
symmnumber: 1
zpe: 743270.8 jmol-1
zpe.correction: 0.283097 hartree
zpe.thermalcorrener: 0.303835 hartree
zpe.thermalcorrenthalpy: 0.304779 hartree
zpe.thermalcorrgfe: 0.234253 hartree
zpe.sumelectzpe: -1199.040721 hartree
zpe.sumelectthermal: -1199.019983 hartree
zpe.sumelectthermalent: -1199.019039 hartree
zpe.sumelectthermalfe: -1199.089565 hartree
dipole: 2.2093 1.5899 -8.2780
dipole: 8.7141
quadrupole: -121.4430 -132.8668 -158.3688
quadrupole: 8.5916 -17.8519 1.2583
quadrupole: 16.1165 4.6927 -20.8093 8.5916 -17.8519 1.2583
hfenergy: -1199.3238176 hartree
pointgroup: C01 [X(C20H13N1O5)]
dipole: -0.7045143 -0.6854102 -3.2844546 debye
polarizability: 288.7912412|1.9524778|275.7215874|-1.8759193|-1.7670552|191.1454382 unknown
InChI: InChI=1S/C20H13NO5/c21-10-1-4-13-16(7-10)20(26-19(13)24)14-5-2-11(22)8-17(14)25-18-9-12(23)3-6-15(18)20/h1-9,22-23H,21H2
charge 0 multiplicity 1
39 atoms
O  -0.422312 0.013581 1.969465
O  2.822076 0.008975 -0.047421
O  -2.335653 0.003274 3.319342
O  2.903074 4.838732 -0.398548
O  3.077876 -4.742793 -0.296836
N  -3.640656 -0.038482 -3.198578
C  -0.104614 0.000902 0.443473
C  -1.506571 -0.012857 -0.169644
C  0.690182 1.256622 0.147825
C  0.702614 -1.254236 0.175596
C  -2.483236 -0.013399 0.848065
C  2.09286 1.212775 -0.030218
C  2.108071 -1.203555 -0.004308
C  -1.835851 0.001298 2.177038
C  -1.85914 -0.021811 -1.52276
C  0.073105 2.535394 0.127513
C  0.097242 -2.535008 0.187184
C  -3.858597 -0.023791 0.525978
C  -3.246759 -0.031176 -1.865639
C  2.866282 2.377696 -0.216948
C  2.891527 -2.362215 -0.162452
C  -4.235773 -0.032896 -0.826171
C  0.811222 3.713017 -0.056571
C  0.848874 -3.711452 0.031784
C  2.217176 3.628263 -0.223662
C  2.25619 -3.616817 -0.138499
H  -1.09314 -0.019335 -2.306696
H  -1.010445 2.599804 0.27188
H  -0.985677 -2.605373 0.332924
H  -4.608364 -0.023306 1.323865
H  3.948887 2.277614 -0.351193
H  3.972425 -2.286701 -0.297805
H  -5.297265 -0.039802 -1.101407
H  0.334308 4.696312 -0.062871
H  0.354268 -4.690176 0.052025
H  -4.624599 -0.03927 -3.452151
H  -2.953066 -0.030359 -3.946781
H  3.877836 4.689485 -0.478257
H  2.549122 -5.576734 -0.238342
