program: Gaussian 09
title: 000103921
version: EM64L-G09RevD.01
frameworkgroup: C1[X(C19H28O4)]
method: RPBEPBE
basis: SDD
operation: Freq
keyword: #pfreq=noraman
keyword: PBEPBE/SDD
title: #p freq=noraman PBEPBE/SDD
converged: YES YES NO NO
title: Mulliken charges:
elementType: O O O O C C C C C C C C C C C C C C C C C C C H H H H H H H H H H H H H H H H H H H H H H H H H H H H
charge: -0.265131 -0.239348 -0.437284 -0.234034 -0.375309 -0.414742 -0.390666 -0.376797 -0.355545 -0.365438 -0.354375 -0.399377 -0.354559 -0.271761 -0.696789 0.178094 0.194800 0.174639 -0.369049 -0.325200 -0.217965 -0.218070 0.097563 0.179431 0.193323 0.198222 0.196052 0.187682 0.208814 0.185358 0.201691 0.184551 0.181261 0.192123 0.233678 0.190572 0.185398 0.193036 0.211500 0.196544 0.193010 0.232589 0.231173 0.209582 0.214371 0.210556 0.268717 0.272943 0.240203 0.239425 0.384536
chargesum: 0.00000
title: Mulliken charges with hydrogens summed into heavy atoms:
elementType: O O O O C C C C C C C C C C C C C C C C C C C
charge: -0.265131 -0.239348 -0.052748 -0.234034 -0.002556 -0.020467 0.005830 0.010252 0.010267 0.060363 0.021595 0.005159 0.034995 0.192001 -0.062280 0.178094 0.194800 0.174639 -0.100332 -0.052257 0.022239 0.021355 0.097563
polarizability: 2.34050295e+02 -2.99893058e+00 2.61341919e+02 2.41598836e+01 -8.54770933e+00 1.59877172e+02
1716.lowfreq: -0.0005 -0.0004 0.0004 1.5720 2.9550 6.2232 8.9948 17.7422 26.0409
frequency: 8.6071 17.7246 25.8812 35.3697 38.2016 52.3123 60.7225 75.5958 81.0881 90.5506 105.1849 109.0538 121.6171 131.0201 139.1609 165.5067 191.8250 204.0872 212.4761 230.6806 242.8345 247.6578 260.6918 265.7949 317.6645 332.2180 355.3724 391.6072 401.9220 405.9332 442.5472 464.7921 507.3419 518.9552 545.8661 584.6307 596.7486 651.9344 674.3140 706.2009 709.7667 723.1562 732.6938 748.7049 756.6215 779.0394 790.4715 796.0536 815.9107 835.5919 859.4671 863.4750 887.9827 904.1806 904.7472 912.9211 976.0479 977.2897 994.7240 996.7939 1005.7726 1008.1686 1025.7907 1033.9189 1036.1340 1061.6742 1072.8766 1075.3641 1083.7660 1090.9269 1110.3007 1113.3225 1129.8055 1132.4720 1161.4003 1161.7387 1178.3474 1191.9222 1213.3631 1222.0491 1238.3387 1239.0792 1254.4174 1271.9183 1278.7165 1280.2125 1282.3872 1287.6031 1290.6669 1294.6090 1304.0245 1310.6077 1329.6586 1343.5691 1348.9887 1352.6883 1357.3191 1361.2692 1368.5072 1382.5429 1391.5024 1430.0099 1450.3247 1457.4511 1461.2326 1463.0270 1467.1573 1467.7840 1468.5392 1475.4226 1477.5486 1478.7560 1482.1352 1484.4797 1488.7749 1579.1559 1603.7445 1617.3001 1644.7669 2948.1540 2951.1780 2953.8957 2955.2750 2962.1106 2967.4235 2967.8567 2971.2732 2971.6783 2977.1023 2985.3762 2993.9837 3001.8469 3003.5504 3006.6895 3021.7591 3025.3820 3028.9154 3039.3455 3062.3255 3068.1424 3069.8592 3072.9455 3139.6004 3154.4190 3168.1198 3180.4770 3512.5458
redmass: 5.3071 4.5351 4.8214 5.2492 6.1739 1.6500 4.0906 4.8691 3.0330 3.0904 3.1603 3.6649 1.7138 2.9754 3.2766 2.6775 2.6700 4.8302 4.8832 1.1303 3.6656 2.1257 4.7111 3.0999 4.0464 3.0336 7.1898 6.4049 2.5246 3.2558 2.6492 3.0889 2.4504 4.1166 4.7301 1.2875 4.7739 5.9806 5.0382 3.0667 1.2366 1.0835 1.2755 2.3591 1.9635 1.9921 1.7974 1.7297 1.9876 2.9627 2.9697 1.7234 1.8586 1.6074 1.4746 1.7129 1.2911 1.4378 2.8739 4.3033 1.3720 2.4171 2.5025 2.1537 1.9680 2.7826 3.3604 2.1397 2.1259 1.7975 1.8605 2.1781 2.0670 2.3463 1.4749 1.6827 1.0652 1.6507 1.2582 1.3556 1.3371 2.6477 1.3288 1.2342 1.1953 1.5419 1.1326 1.1960 1.1147 1.1313 1.1220 2.4903 1.4302 1.4521 1.4039 1.6458 1.5037 1.4642 1.6428 10.5952 1.2177 2.2208 1.0792 1.0808 1.0717 1.0778 1.0969 1.0878 1.0764 1.0735 1.0428 2.5329 1.0941 1.0900 1.0911 7.2725 6.3260 11.4219 8.9969 1.0588 1.0595 1.0592 1.0609 1.0603 1.0606 1.0614 1.0645 1.0366 1.0628 1.0955 1.0959 1.1000 1.0599 1.0993 1.0980 1.1031 1.0964 1.1041 1.1000 1.1006 1.0993 1.1077 1.0864 1.0911 1.0963 1.0984 1.0642
irintensity: 0.2998 0.3276 0.2413 0.4827 0.7530 0.0312 1.2307 2.3980 0.2530 0.2431 0.9301 1.1342 0.1795 0.9659 1.0642 0.6376 0.4158 1.3826 0.9772 0.0088 3.3547 0.9851 3.0047 1.4914 1.7010 0.4427 5.3182 10.4503 0.1643 7.9053 0.4108 5.2528 1.9360 16.6621 9.1925 155.7150 37.0154 9.9636 9.9462 104.2080 16.8918 12.6380 0.5999 5.4339 8.3450 12.5071 35.4492 4.5113 0.9282 2.5182 5.3288 0.8047 12.7973 2.8182 0.2639 2.7247 0.5568 22.5294 44.0148 179.2711 3.5662 3.1376 0.0443 29.5865 49.3247 0.3536 181.0674 8.3410 44.1709 13.4170 41.1166 0.9652 1.6130 2.8007 20.1958 49.8688 0.0407 1.2625 10.0418 9.1291 3.3460 194.4642 4.6330 1.9906 2.0565 53.3779 1.1883 8.4709 1.4926 1.4849 0.7107 89.3733 0.2520 0.9295 0.7662 1.4099 4.6052 4.1133 1.7073 10.2293 11.5947 7.3518 4.0881 10.0017 1.1873 1.1264 16.5030 2.2799 0.7368 2.8073 11.9117 16.0892 17.3818 6.7869 18.4191 35.1743 25.9378 176.8295 220.6357 1.5909 17.7977 2.3890 18.4167 20.1014 122.2473 49.4560 10.0612 36.0024 66.0580 7.4286 16.5813 6.4649 20.7783 22.1022 56.3367 27.4540 1.9148 205.2660 83.4289 96.5983 52.2663 35.7998 2.1504 7.8903 10.7845 11.1866 41.9464
temp: 298.150 k
press: 1.00000 atm
elementType: 8 8 8 8 6 6 6 6 6 6 6 6 6 6 6 6 6 6 6 6 6 6 6 1 1 1 1 1 1 1 1 1 1 1 1 1 1 1 1 1 1 1 1 1 1 1 1 1 1 1 1
symmnumber: 1
zpe: 1135339.3 jmol-1
zpe.correction: 0.432428 hartree
zpe.thermalcorrener: 0.457958 hartree
zpe.thermalcorrenthalpy: 0.458902 hartree
zpe.thermalcorrgfe: 0.372348 hartree
zpe.sumelectzpe: -1039.954289 hartree
zpe.sumelectthermal: -1039.928759 hartree
zpe.sumelectthermalent: -1039.927815 hartree
zpe.sumelectthermalfe: -1040.014369 hartree
dipole: 2.2480 1.6184 -1.1937
dipole: 3.0162
quadrupole: -148.8517 -122.6711 -140.2269
quadrupole: -11.1774 10.4634 2.3610
quadrupole: -11.6018 14.5788 -2.9770 -11.1774 10.4634 2.3610
hfenergy: -1040.3867167 hartree
pointgroup: C01 [X(C19H28O4)]
dipole: -0.8469545 0.7142633 0.4250873 debye
polarizability: 232.32284|5.2336226|260.7265675|28.1122272|5.8489578|162.2199798 unknown
InChI: InChI=1S/C19H28O4/c1-2-3-4-5-6-7-8-9-12-15-23-19(22)17-14-11-10-13-16(17)18(20)21/h10-11,13-14,20H,2-9,12,15H2,1H3
charge 0 multiplicity 1
51 atoms
O  1.910649 -1.391203 0.807365
O  4.208294 -1.378068 0.404421
O  -0.277399 1.107938 -1.489906
O  1.254276 -0.595445 -1.860415
C  -3.177536 -1.846528 -1.039784
C  -2.997628 -3.296742 -0.521404
C  -3.678729 -0.845803 0.026848
C  -1.944774 -3.472845 0.602994
C  -3.908724 0.577134 -0.531324
C  -0.514553 -3.063089 0.187246
C  -4.459655 1.567735 0.519212
C  0.530632 -3.335962 1.291311
C  -4.656906 2.997474 -0.034696
C  1.942896 -2.883608 0.920275
C  -5.207281 3.982298 1.019315
C  3.108064 -0.778626 0.467174
C  2.93858 0.704898 0.296128
C  1.872782 1.305809 -0.435831
C  3.885631 1.53091 0.94638
C  1.744261 2.717909 -0.450301
C  3.759766 2.936425 0.913333
C  2.677064 3.530949 0.226356
C  0.971567 0.488475 -1.301338
H  -2.217605 -1.483849 -1.465047
H  -3.899187 -1.859549 -1.882801
H  -2.716678 -3.948347 -1.374523
H  -3.978649 -3.664769 -0.155624
H  -4.627049 -1.226827 0.461289
H  -2.953343 -0.788933 0.863214
H  -1.940239 -4.537545 0.917246
H  -2.246391 -2.89091 1.497644
H  -4.609018 0.527153 -1.391708
H  -2.949498 0.975275 -0.92566
H  -0.226455 -3.608947 -0.735214
H  -0.483369 -1.98838 -0.066737
H  -3.766606 1.604744 1.385569
H  -5.427422 1.189312 0.910459
H  0.571658 -4.423226 1.509148
H  0.227269 -2.834349 2.231383
H  -3.687447 3.371576 -0.422949
H  -5.346282 2.95996 -0.903214
H  2.271668 -3.285761 -0.055904
H  2.692594 -3.154393 1.685881
H  -6.18936 3.64499 1.401641
H  -5.338451 4.996476 0.598836
H  -4.520997 4.060453 1.883769
H  4.712914 1.056002 1.483157
H  0.918462 3.163849 -1.011166
H  4.498272 3.561472 1.426228
H  2.5684 4.620236 0.204282
H  -0.825968 0.542353 -2.098859
