program: Gaussian 09
title: 000103858
version: EM64L-G09RevD.01
frameworkgroup: C1[X(C4H8O2S)]
method: RPBEPBE
basis: SDD
operation: Freq
keyword: #pfreq=noraman
keyword: PBEPBE/SDD
title: #p freq=noraman PBEPBE/SDD
converged: YES YES NO NO
title: Mulliken charges:
elementType: S O O C C C C H H H H H H H H
charge: 0.020019 -0.271792 -0.215593 -0.548206 -0.631434 0.335498 -0.501602 0.287356 0.237402 0.244916 0.227554 0.090863 0.234671 0.243775 0.246573
chargesum: 0.00000
title: Mulliken charges with hydrogens summed into heavy atoms:
elementType: S O O C C C C
charge: 0.110882 -0.271792 -0.215593 -0.260850 0.078438 0.335498 0.223417
polarizability: 8.36527119e+01 -3.89844321e+00 6.45121595e+01 -9.44656300e-01 -4.85680968e+00 4.64423016e+01
1716.lowfreq: -8.8713 -0.0034 -0.0023 -0.0012 7.7484 15.0594 26.8901 104.8741 130.1711
frequency: 26.8109 104.8607 130.1667 168.0581 239.7845 251.6779 260.7926 282.5979 323.2381 375.5125 597.4528 686.6915 703.1676 782.9369 886.8105 943.6241 1000.6528 1056.1821 1072.5001 1113.7811 1124.5206 1149.9819 1239.3537 1300.8558 1385.5166 1423.5482 1453.2267 1464.0635 1468.6130 1471.4609 1653.4676 2426.8797 2989.8822 3006.5274 3054.5277 3089.4511 3104.6084 3109.8091 3151.9293
redmass: 5.6259 1.0878 3.1923 4.0989 1.2297 1.1411 3.1536 2.7056 4.2404 5.8875 4.0750 3.7840 4.9250 3.2659 1.2525 4.9289 1.6550 2.6831 1.8209 1.2661 2.5135 1.4324 1.3253 1.6369 1.1830 1.1749 1.0497 1.0511 1.0428 1.0542 9.9541 1.0381 1.0345 1.0294 1.0853 1.1002 1.1007 1.1048 1.1050
irintensity: 0.4724 0.6313 3.4269 4.1789 8.5266 13.7966 5.4956 9.1323 10.7401 3.6111 7.0367 3.9520 3.3862 15.4223 12.3811 8.0778 6.8433 4.7580 120.5523 0.3551 231.5584 4.0107 2.6181 30.9049 13.3186 15.2363 14.6826 9.3933 17.9584 17.9279 147.2102 39.4469 20.2448 30.7527 4.9897 21.7011 17.1720 25.6719 14.8158
temp: 298.150 k
press: 1.00000 atm
elementType: 16 8 8 6 6 6 6 1 1 1 1 1 1 1 1
symmnumber: 1
zpe: 299518.1 jmol-1
zpe.correction: 0.114080 hartree
zpe.thermalcorrener: 0.123242 hartree
zpe.thermalcorrenthalpy: 0.124186 hartree
zpe.thermalcorrgfe: 0.079170 hartree
zpe.sumelectzpe: -705.147143 hartree
zpe.sumelectthermal: -705.137981 hartree
zpe.sumelectthermalent: -705.137037 hartree
zpe.sumelectthermalfe: -705.182053 hartree
dipole: -1.3804 2.9966 -1.1338
dipole: 3.4886
quadrupole: -39.6438 -53.5089 -50.6999
quadrupole: 3.9901 -1.8586 2.0339
quadrupole: 8.3071 -5.5581 -2.7490 3.9901 -1.8586 2.0339
hfenergy: -705.261223 hartree
pointgroup: C01 [X(C4H8O2S1)]
dipole: 0.4506564 -1.2383959 -0.3835833 debye
dipolederiv: -0.054766 0.1932581 0.0800307 0.1537686 -0.0132121 0.1852455 0.0858967 0.1779535 -0.153752 -1.3956271 0.2383881 0.1124138 0.3220177 -0.535259 -0.1427026 0.1548955 -0.1330364 -0.362472 -0.6419451 -0.132927 -0.0650085 0.1929234 -0.7300908 -0.2104332 0.0765335 -0.2644347 -0.4065331 0.1098099 -0.3157668 -0.0129223 -0.381568 0.0965719 -0.1030498 -0.0000018 -0.0751381 0.112407 -0.0868699 0.0483452 -0.0291648 0.0743259 -0.0303383 0.0671382 -0.046505 -0.0176546 0.0185874 1.5118719 -0.1009227 -0.0875126 -0.3520122 0.9288363 0.4204286 -0.1982993 0.4384146 0.385742 0.639192 -0.0200705 -0.005525 0.0694649 0.2256741 -0.0202633 0.0614232 -0.0280157 0.2640549 -0.0220318 0.0549484 0.0338925 0.0674374 0.0074504 -0.042652 0.0230797 -0.0268811 -0.0581024 0.0001554 0.1301998 0.0163563 0.1354778 -0.0423408 0.030862 -0.0016753 0.0213342 0.0892352 0.1137528 -0.0146408 0.0171011 0.0027876 0.0663471 -0.082132 0.0210152 -0.0120634 -0.0879154 -0.0860175 -0.1207215 -0.0494262 -0.0998702 0.0392772 -0.0061584 -0.0566674 -0.010833 0.0667444 -0.0547641 -0.0357621 -0.0588421 -0.1403889 -0.0663512 -0.1173052 -0.0880912 -0.0940912 0.1033988 -0.0269735 0.0679752 0.0326413 0.1112487 0.0043659 -0.0611328 0.0530834 -0.061422 0.0893362 0.000031 0.0000707 0.0215331 -0.052696 0.1004939 -0.01267 -0.0760537 0.0036203 -0.1114271 -0.0058179 0.007626 -0.0055672 -0.1029166 -0.0514245 0.0948251 -0.0086334 0.0822479 0.050696 unknown
polarizability: 82.7779363|-5.4678601|65.6730587|2.3861002|3.8162743|46.156178 unknown
InChI: InChI=1S/C4H8O2S/c1-3(7)4(5)6-2/h3,7H,1-2H3
charge 0 multiplicity 1
15 atoms
S  -2.38651 0.934503 -0.244837
O  1.348447 -0.550359 -0.400391
O  0.451293 1.34658 0.614529
C  -1.031227 -0.398423 -0.369235
C  -1.322175 -1.614076 0.539888
C  0.290018 0.26609 0.010893
C  2.706039 -0.058193 -0.055155
H  -0.962792 -0.720996 -1.421627
H  -0.505989 -2.354523 0.45761
H  -1.416332 -1.296389 1.592258
H  -2.266765 -2.100574 0.240309
H  -3.365865 0.111151 -0.784926
H  3.389486 -0.822243 -0.450585
H  2.808033 0.042254 1.038413
H  2.885638 0.921798 -0.527745
