program: Gaussian 09
title: 000103906
version: EM64L-G09RevD.01
frameworkgroup: C1[X(C15H24N4O2)]
method: RPBEPBE
basis: SDD
operation: Freq
keyword: #p
keyword: freq=noraman
keyword: PBEPBE/SDD
title: #p freq=noraman PBEPBE/SDD
converged: YES YES NO NO
title: Mulliken charges:
elementType: O O N N N N C C C C C C C C C C C C C C C H H H H H H H H H H H H H H H H H H H H H H H H
charge: -0.278282 -0.283191 -0.395143 -0.366812 -0.127255 -0.060363 -0.407296 -0.326928 -0.375023 -0.454767 0.083522 0.160297 0.428528 0.098978 -0.528596 -0.243607 -0.262768 -0.798736 -0.312320 -0.501232 -0.493455 0.244292 0.223719 0.256971 0.202087 0.213674 0.214160 0.231512 0.204255 0.328130 0.310310 0.246532 0.188475 0.203415 0.185761 0.204323 0.243806 0.245459 0.227009 0.231254 0.195796 0.201409 0.236418 0.202085 0.203597
chargesum: 0.00000
title: Mulliken charges with hydrogens summed into heavy atoms:
elementType: O O N N N N C C C C C C C C C C C C C C C
charge: -0.278282 -0.283191 -0.067013 -0.056501 -0.127255 -0.060363 0.060716 0.132130 0.052811 -0.018999 0.083522 0.160297 0.428528 0.098978 -0.282064 0.148282 0.127316 -0.082462 -0.312320 0.127226 0.148645
polarizability: 2.74125697e+02 2.88493874e+01 2.20695363e+02 -1.57342438e+01 1.83563372e+01 1.46967358e+02
1716.lowfreq: -6.6398 -4.5987 -0.0008 -0.0006 0.0004 0.9190 9.6885 15.4466 24.2621
frequency: 9.1629 15.1362 24.2493 30.0141 46.6126 59.9000 68.3459 79.1196 81.6708 88.1692 100.7551 116.1830 120.2008 138.0286 148.6435 193.8176 200.7881 210.4750 220.3233 226.5839 238.2842 251.9633 260.6083 278.5963 299.5163 333.1716 386.8321 411.4132 440.3970 473.9537 482.7380 499.1816 509.0625 514.6636 544.9486 554.4106 578.0024 613.5726 678.5186 700.7833 724.2289 756.1628 763.2663 797.3958 825.5472 853.8333 860.9142 892.7500 907.6207 931.5774 970.0438 988.1285 1011.2773 1036.0688 1044.9090 1063.4964 1068.3583 1092.4486 1096.9567 1097.6696 1108.7860 1113.6150 1121.4355 1131.5941 1138.2437 1156.1574 1161.3220 1182.5951 1194.4673 1201.7163 1233.8562 1238.8207 1252.9125 1277.5843 1286.5457 1305.7767 1326.4073 1331.1137 1353.8393 1366.9670 1374.2937 1381.3642 1387.2794 1398.7236 1410.3355 1429.8736 1437.5638 1439.3014 1456.2206 1456.6677 1458.2440 1458.8374 1461.9649 1462.9717 1468.5222 1470.3833 1474.7762 1487.0947 1488.0466 1502.1906 1521.3022 1526.4450 1570.3430 1601.7491 2133.4167 2911.8451 2916.2481 2926.8643 2928.2948 2940.7215 2963.0377 2974.7368 2984.3563 2988.3693 2988.5972 2990.1835 3000.1351 3000.5774 3017.0695 3053.2879 3053.9971 3063.6836 3082.1744 3097.4584 3098.7897 3105.8008 3172.5745 3536.2971 3546.5755
redmass: 4.4789 3.5561 4.2523 4.2440 3.2773 2.3498 3.1357 1.1660 2.2429 3.5431 4.0480 5.4399 2.4830 2.7798 3.0698 3.5091 1.9170 2.9669 1.3044 1.9724 2.9854 3.1245 4.7858 2.7784 3.2609 3.1608 3.8367 3.3505 4.8924 3.3044 1.3027 2.3375 3.7686 4.2843 3.4145 1.4712 5.0797 4.6954 4.5417 4.2733 5.5178 4.6453 1.6286 1.2943 1.5797 2.2123 2.0915 3.7483 1.6624 2.5632 2.9631 2.2404 2.9165 2.0461 1.5507 5.9618 3.2501 2.2527 1.9624 2.4449 1.8108 1.4355 1.6606 2.8128 2.3545 1.4472 1.5698 1.6866 1.4513 1.6022 1.3094 1.6008 1.2711 1.1501 1.1573 1.4358 1.5558 1.7629 1.6172 1.6017 1.4287 1.8945 1.4412 1.2714 2.0015 2.7656 1.1793 1.1518 1.0862 1.0515 1.0512 1.1055 1.0938 1.0446 1.0613 1.0665 1.2431 1.0814 1.0760 1.1003 2.7199 2.5676 5.2135 5.6027 12.5869 1.0544 1.0404 1.0495 1.0363 1.0660 1.0993 1.1047 1.0373 1.0613 1.0660 1.1022 1.0644 1.1025 1.0929 1.1032 1.1028 1.0970 1.0980 1.0996 1.0968 1.0973 1.0918 1.0771 1.0764
irintensity: 0.1157 0.6326 0.2708 0.4255 0.3472 4.7661 7.3142 0.4848 1.2299 2.8150 3.5757 5.4374 9.6245 1.4843 0.7640 0.3494 4.1655 1.1659 1.6613 3.2938 1.4184 3.4670 3.9884 3.3089 0.7419 4.6079 5.4745 3.2806 3.4244 11.6112 77.0568 4.2934 0.2211 6.1033 8.8025 106.3373 21.8103 5.4451 0.5565 6.7057 3.4294 4.3609 3.6424 5.2883 38.4654 14.5765 5.9411 7.8491 2.2958 2.6781 2.8214 0.9066 34.4994 2.7636 7.5766 122.4720 40.2015 19.6735 27.7165 14.4032 28.8127 0.9545 5.8796 14.4451 18.6999 16.3371 5.6338 3.4660 11.8516 10.2316 14.0688 16.9695 28.3914 3.1953 1.4132 6.2004 2.9970 30.0247 31.1412 5.1722 51.9575 55.1425 12.1531 34.8735 1.9114 123.9113 0.8145 0.6538 14.9856 11.9318 11.4455 39.8709 7.4611 13.7483 15.8261 8.6926 88.3671 16.9981 5.9402 77.2846 11.3857 267.9800 452.6725 762.3363 188.5248 46.1039 60.6222 86.7026 109.3674 54.9784 54.9601 47.9829 15.8490 13.2517 48.2949 72.4114 83.5099 75.2326 8.9669 40.7545 47.5623 11.9089 13.8859 20.4106 38.6487 26.4172 9.4666 39.6670 48.0581
temp: 298.150 k
press: 1.00000 atm
elementType: 8 8 7 7 7 7 6 6 6 6 6 6 6 6 6 6 6 6 6 6 6 1 1 1 1 1 1 1 1 1 1 1 1 1 1 1 1 1 1 1 1 1 1 1 1
symmnumber: 1
zpe: 987486.1 jmol-1
zpe.correction: 0.376114 hartree
zpe.thermalcorrener: 0.400639 hartree
zpe.thermalcorrenthalpy: 0.401583 hartree
zpe.thermalcorrgfe: 0.316835 hartree
zpe.sumelectzpe: -953.793293 hartree
zpe.sumelectthermal: -953.768768 hartree
zpe.sumelectthermalent: -953.767823 hartree
zpe.sumelectthermalfe: -953.852572 hartree
dipole: -7.4061 -4.1941 1.1574
dipole: 8.5896
quadrupole: -120.7652 -136.2187 -122.4812
quadrupole: -3.7206 -10.1382 -0.0322
quadrupole: 5.7232 -9.7303 4.0072 -3.7206 -10.1382 -0.0322
hfenergy: -954.1694062 hartree
pointgroup: C01 [X(C15H24N4O2)]
dipole: 2.6044959 1.7510918 1.253237 debye
polarizability: 261.4021956|26.3287449|230.1962341|36.7561652|12.5991919|150.1899888 unknown
InChI: InChI=1S/C15H24N4O2/c1-12-10-14(17-6-4-8-20-2)19-15(13(12)11-16)18-7-5-9-21-3/h10,17-18H,4-9H2,1-3H3
charge 0 multiplicity 1
45 atoms
O  -4.611333 2.217801 1.116978
O  5.780391 1.1276 0.327374
N  -2.614274 -0.547616 -1.71219
N  1.546362 0.816753 -0.089388
N  -0.512899 0.092753 -0.874022
N  -2.94252 -4.087689 -1.441219
C  -3.005837 0.82775 -2.057627
C  2.889483 0.707662 0.490694
C  -4.055388 1.43694 -1.096698
C  3.570765 2.089081 0.526476
C  -1.405456 -0.897651 -1.144171
C  0.696767 -0.243191 -0.323189
C  0.142781 -2.623134 -0.275547
C  -1.118609 -2.289984 -0.858898
C  1.057349 -1.59087 -0.005122
C  -3.527448 1.616533 0.329586
C  4.966844 2.025504 1.153424
C  0.477378 -4.066855 0.036435
C  -2.091932 -3.284156 -1.16585
C  -4.242759 2.392549 2.51831
C  7.14627 0.993487 0.828214
H  -2.084464 1.433799 -2.051885
H  -3.412603 0.831553 -3.087299
H  3.517801 0.016567 -0.102923
H  2.831036 0.297783 1.522561
H  -4.963453 0.804425 -1.064809
H  -4.364815 2.424705 -1.489855
H  3.659435 2.486173 -0.502777
H  2.95353 2.800361 1.111753
H  -3.282726 -1.300841 -1.888037
H  1.185353 1.73353 -0.360335
H  2.028801 -1.820226 0.437839
H  -2.631125 2.276719 0.338467
H  -3.23337 0.637837 0.768125
H  4.914149 1.64004 2.198029
H  5.424373 3.03937 1.181303
H  -0.264599 -4.505649 0.728951
H  0.458005 -4.684512 -0.8806
H  1.476526 -4.155766 0.493752
H  -5.117437 2.838939 3.017678
H  -3.369231 3.071448 2.630977
H  -3.999458 1.421225 3.001124
H  7.66275 0.306821 0.139558
H  7.164378 0.568617 1.854849
H  7.67481 1.970815 0.837785
