program: Gaussian 09
title: 000103872
version: EM64L-G09RevD.01
frameworkgroup: C1[X(C12H22O3)]
method: RPBEPBE
basis: SDD
operation: Freq
keyword: #pfreq=noraman
keyword: PBEPBE/SDD
title: #p freq=noraman PBEPBE/SDD
converged: YES YES NO NO
title: Mulliken charges:
elementType: O O O C C C C C C C C C C C C H H H H H H H H H H H H H H H H H H H H H H
charge: -0.471963 -0.262752 -0.272633 0.239716 -0.597086 -0.338752 -0.724813 0.284607 -0.369744 0.386179 -0.276519 -0.340909 -0.788623 -0.823186 -0.685364 0.258373 0.237631 0.209345 0.209580 0.223201 0.244392 0.210698 0.194297 0.235901 0.225013 0.190566 0.221118 0.359970 0.221819 0.216462 0.225566 0.212902 0.295041 0.211961 0.206665 0.211774 0.219566
chargesum: 0.00000
title: Mulliken charges with hydrogens summed into heavy atoms:
elementType: O O O C C C C C C C C C C C C
charge: -0.111992 -0.262752 -0.272633 0.239716 -0.101082 -0.129407 -0.047640 0.284607 0.035251 0.386179 0.184395 0.070774 -0.124775 -0.103282 -0.047359
polarizability: 1.73165814e+02 4.05411036e+00 1.33274938e+02 -5.95418203e+00 -5.75608110e+00 1.22999403e+02
1716.lowfreq: -12.3601 -3.8399 0.0001 0.0004 0.0007 8.6261 14.0292 29.7808 46.7469
frequency: 12.4706 29.4146 46.6474 58.6896 64.2299 84.1260 118.6067 143.8510 163.4066 167.0470 186.9224 205.7970 214.3141 219.9588 228.3592 253.4088 259.3901 310.8147 322.2828 328.4933 350.1914 396.8323 416.9049 451.7552 485.1815 522.4510 542.2906 602.6535 620.3679 714.9113 737.1169 773.1987 796.6039 823.4661 825.0357 832.8509 890.6601 898.6491 902.3336 946.6118 950.7600 954.9229 973.2177 992.1899 1030.0319 1060.4037 1069.9339 1071.5640 1087.7352 1111.8941 1124.2675 1130.6140 1139.1477 1173.5789 1213.7902 1231.5408 1243.4368 1257.8464 1289.0185 1305.0730 1306.9263 1359.0454 1359.6399 1364.3910 1365.2048 1383.4429 1387.3336 1391.2057 1397.4325 1424.1612 1452.2403 1453.5244 1455.9417 1461.0560 1470.4472 1471.3269 1472.7121 1474.6113 1477.8625 1485.8644 1495.4047 1607.9460 1684.4240 2957.8826 2962.1230 2972.9775 2975.9647 2981.3761 2989.1457 3003.5569 3006.5391 3026.0343 3027.6561 3033.8439 3046.8238 3064.5025 3072.0596 3075.4494 3076.8072 3077.0284 3079.0058 3088.7066 3104.3649 3115.2035 3412.3220
redmass: 3.8019 3.2472 2.9382 3.8444 1.8386 3.6801 3.3011 2.9212 1.1544 2.2666 2.7712 1.4089 1.4697 1.1810 1.7751 2.1261 2.8971 3.8294 3.8895 2.6123 3.8002 3.0633 2.2016 2.6609 2.8710 2.6533 2.6765 1.1391 3.5030 2.6776 1.6210 4.8435 2.1914 1.5664 1.7930 2.9861 2.5028 1.9260 2.3782 2.4416 1.2847 1.4914 1.6875 1.2427 2.8728 2.2701 2.0864 1.6678 1.6870 1.9582 2.0233 2.0825 1.8238 2.4026 1.2556 3.1429 1.2848 1.6391 1.1179 1.4842 1.4019 1.4569 1.3706 1.5804 1.5278 1.2690 1.3200 1.2153 1.2220 1.0980 1.0807 1.0537 1.0550 1.0483 1.0827 1.0695 1.0540 1.0509 1.0444 1.0811 1.0546 8.7711 6.5407 1.0380 1.0383 1.0392 1.0583 1.0626 1.0356 1.0616 1.0603 1.0935 1.0960 1.0963 1.1008 1.0908 1.1026 1.0991 1.1042 1.1009 1.0973 1.1001 1.0992 1.0969 1.0654
irintensity: 0.0582 0.5530 0.1147 0.4686 0.1356 0.4628 0.2460 1.2385 1.0875 0.2860 2.5430 1.2981 4.0922 0.9970 6.2945 1.4414 3.5345 8.6301 9.4572 0.3450 1.7666 11.8029 0.9412 13.3382 7.8189 2.0912 4.9602 225.4827 21.7546 1.5780 5.6184 10.4997 12.9151 13.2484 5.8697 3.5071 9.0398 22.4828 3.4851 17.8422 7.8727 3.0914 8.2775 5.9194 22.7082 31.1152 17.5391 67.5506 11.9925 119.2220 9.3207 112.2519 1.4693 218.8510 1.1638 15.2881 1.0634 20.9741 0.1979 63.3856 49.4628 27.0772 6.0291 29.6245 39.7787 28.9123 31.5232 10.5343 14.0053 27.0753 6.3810 8.6276 7.0142 11.8397 13.6654 6.9901 10.8550 4.5880 10.4900 15.1995 16.6374 157.5945 31.6475 17.8063 77.6193 33.9433 6.4266 58.3794 22.0979 7.8952 17.0414 6.6062 11.4399 39.9154 10.2929 9.7273 56.1971 39.6683 47.6964 23.9150 41.5893 38.5761 25.3488 2.6123 99.1678
temp: 298.150 k
press: 1.00000 atm
elementType: 8 8 8 6 6 6 6 6 6 6 6 6 6 6 6 1 1 1 1 1 1 1 1 1 1 1 1 1 1 1 1 1 1 1 1 1 1
symmnumber: 1
zpe: 835656.0 jmol-1
zpe.correction: 0.318285 hartree
zpe.thermalcorrener: 0.337208 hartree
zpe.thermalcorrenthalpy: 0.338153 hartree
zpe.thermalcorrgfe: 0.269362 hartree
zpe.sumelectzpe: -694.918958 hartree
zpe.sumelectthermal: -694.900035 hartree
zpe.sumelectthermalent: -694.899090 hartree
zpe.sumelectthermalfe: -694.967881 hartree
dipole: -2.8158 1.5620 1.1179
dipole: 3.4086
quadrupole: -88.3296 -92.8440 -93.6041
quadrupole: 6.0910 4.4672 -3.2551
quadrupole: 3.2629 -1.2515 -2.0115 6.0910 4.4672 -3.2551
hfenergy: -695.237243 hartree
pointgroup: C01 [X(C12H22O3)]
dipole: 1.1935674 0.4111135 -0.4524915 debye
polarizability: 168.1457059|-11.0685519|134.4572745|-9.3174558|9.7324444|126.8371752 unknown
InChI: InChI=1S/C12H22O3/c1-5-6-7-15-11(13)9-12(4,14)8-10(2)3/h8,14H,5-7,9H2,1-4H3
charge 0 multiplicity 1
37 atoms
O  -2.734047 -0.885514 0.537186
O  1.531608 -0.967932 -0.281435
O  -0.070406 -1.166055 1.388327
C  -2.069737 -0.0938 -0.524194
C  -0.773912 -0.849253 -0.963126
C  -1.70773 1.329414 -0.079208
C  -3.07449 -0.084453 -1.695362
C  0.221976 -1.005995 0.172441
C  3.946374 -1.099138 0.025181
C  -2.462532 2.200005 0.6513
C  2.603732 -1.161927 0.751886
C  4.249028 0.277417 -0.609335
C  -1.936314 3.590185 0.974288
C  -3.847063 1.897568 1.197986
C  5.617782 0.308782 -1.321714
H  -1.070821 -1.863264 -1.294551
H  -0.279716 -0.349117 -1.813567
H  -0.724179 1.682576 -0.429089
H  -2.668265 0.468289 -2.560877
H  -3.312432 -1.11921 -2.00106
H  -4.008523 0.406829 -1.377181
H  3.975607 -1.885735 -0.753932
H  4.73745 -1.350499 0.761451
H  2.430425 -2.136261 1.243489
H  2.495108 -0.363967 1.509525
H  4.221109 1.056445 0.179873
H  3.445219 0.526091 -1.327585
H  -2.059993 -1.003299 1.26608
H  -1.845059 3.730796 2.069868
H  -2.636951 4.369827 0.614379
H  -0.947577 3.778364 0.520447
H  -3.89227 2.133187 2.279932
H  -4.12112 0.841445 1.060651
H  -4.602532 2.542885 0.705339
H  6.441412 0.087651 -0.616522
H  5.659874 -0.442515 -2.132792
H  5.814865 1.299478 -1.770095
