program: Gaussian 09
title: 000103852
version: EM64L-G09RevD.01
frameworkgroup: C1[X(C15H24O2)]
method: RPBEPBE
basis: SDD
operation: Freq
keyword: #pfreq=noraman
keyword: PBEPBE/SDD
title: #p freq=noraman PBEPBE/SDD
converged: YES YES NO NO
title: Mulliken charges:
elementType: O O C C C C C C C C C C C C C C C H H H H H H H H H H H H H H H H H H H H H H H H
charge: -0.262067 -0.250071 -0.048932 -0.468090 -0.536386 -0.451590 0.485952 -0.428498 -0.345990 -0.574343 -0.452042 -0.294940 0.370015 0.291913 -0.784152 -0.792297 -0.755301 0.231613 0.209967 0.203167 0.213683 0.217125 0.233019 0.200572 0.212202 0.235477 0.227002 0.214656 0.208857 0.199753 0.215487 0.213074 0.215055 0.227857 0.215213 0.220432 0.218693 0.225725 0.246181 0.247039 0.244970
chargesum: 0.00000
title: Mulliken charges with hydrogens summed into heavy atoms:
elementType: O O C C C C C C C C C C C C C C C
charge: -0.262067 -0.250071 0.182681 -0.054957 -0.105578 -0.017999 0.485952 -0.216296 0.116490 -0.150829 -0.036803 -0.081866 0.370015 0.291913 -0.126028 -0.127446 -0.017110
polarizability: 2.42226420e+02 -1.54875902e+01 1.54458476e+02 -1.09091487e+01 2.19251732e+00 1.19523610e+02
1716.lowfreq: -32.4744 -12.4561 -0.0005 0.0008 0.0011 2.6688 7.1126 16.4370 20.7160
frequency: -32.4556 16.2799 20.6783 29.6021 36.6719 47.3986 66.7947 83.9042 105.3877 119.6666 144.7556 170.6026 185.2789 206.9814 226.5727 248.9399 270.3868 297.2013 330.1584 341.9773 383.7922 406.8283 439.6408 446.4583 470.7570 483.0820 517.3812 552.7165 566.6703 610.8562 677.5189 748.2517 760.5042 792.3047 806.7109 825.6148 845.0312 846.1105 889.3577 926.3660 934.4393 945.3828 948.0369 967.0809 993.3839 995.8087 999.6428 1005.0363 1041.2049 1041.7134 1058.0590 1076.2068 1082.0845 1105.4919 1109.6837 1131.1689 1136.9495 1154.8089 1170.2612 1190.6983 1207.0189 1218.9332 1228.5650 1255.6189 1260.5990 1269.1706 1285.9187 1302.5706 1311.9531 1324.5126 1340.9307 1351.7475 1358.1857 1368.1770 1377.9979 1382.0305 1386.9880 1397.0638 1453.1705 1454.6269 1454.8199 1455.2990 1458.4953 1461.1572 1465.8979 1468.0095 1471.0633 1473.5987 1475.0580 1480.4877 1648.3059 1688.1642 1694.7860 2935.8474 2949.5585 2956.1172 2962.7410 2964.1580 2969.6246 2976.2313 2982.8019 2992.1441 3005.6474 3007.2638 3021.7781 3022.7357 3027.1095 3030.9778 3032.6025 3047.1822 3060.2382 3067.2641 3079.5431 3088.8725 3092.8641 3095.4332 3142.7920
redmass: 1.0441 3.6966 4.8117 3.6771 4.1422 3.1197 3.1974 2.4419 2.1254 1.3741 4.2112 3.3396 1.1899 2.2148 2.3572 2.8182 2.5902 2.8677 2.5368 2.6746 2.4244 1.9871 2.4805 2.9024 2.4139 3.5546 3.6490 2.8410 2.9928 4.7965 2.6004 1.6234 2.9691 1.7686 1.5927 1.7429 3.2054 1.6510 1.6648 1.5748 3.9890 1.4014 2.3549 1.8117 1.4049 1.8218 3.1944 2.2114 1.7988 1.7310 2.3448 1.8863 1.6641 2.1322 1.6857 1.2251 2.0387 1.9404 1.6616 1.2651 3.5424 1.3746 1.7746 1.3643 1.3687 1.1689 1.2295 1.4099 1.3178 1.3123 1.4189 1.6333 1.4165 1.7471 1.6457 1.2940 1.3182 1.2320 1.0637 1.0545 1.0541 1.0807 1.0801 1.0738 1.0855 1.0824 1.0472 1.0772 1.0875 1.0903 9.2080 6.8665 6.4961 1.0687 1.0642 1.0373 1.0443 1.0554 1.0630 1.0628 1.0783 1.0602 1.0917 1.0367 1.0965 1.0920 1.0970 1.0964 1.1021 1.0967 1.1069 1.0930 1.0970 1.0906 1.0955 1.0974 1.1009
irintensity: 1.2596 0.0561 0.6167 0.5352 0.6396 0.2435 0.3427 1.2066 0.4601 0.0379 0.7919 4.2171 1.4359 4.7673 5.3230 1.9566 0.9869 0.1638 4.0407 0.5958 4.5724 3.8629 4.1828 3.5278 0.9787 1.9292 0.6476 17.0501 2.6388 2.5715 3.3720 3.5387 0.3887 7.8896 3.4069 7.4307 16.4400 17.8298 5.2053 7.5233 25.6038 0.2519 33.2882 1.6101 14.2337 23.9717 13.8558 72.4497 12.5769 10.1636 6.5458 0.3980 3.0102 15.0577 14.5339 11.3888 1.2038 1.3084 4.1287 4.9304 418.2263 4.4379 2.8654 6.2914 1.4117 2.8122 3.4455 1.7115 1.0596 0.7991 0.4770 0.7257 4.9653 6.6561 2.1252 50.2516 26.3663 8.5978 28.1831 2.3403 12.2567 7.6833 2.9640 10.4514 0.2566 2.4493 27.8743 11.6430 17.8845 12.3479 214.3707 2.6498 2.6089 37.1508 30.6263 41.8566 38.9377 33.8291 25.0088 56.9796 8.9969 25.3363 43.4717 3.6263 2.8984 21.5469 5.1930 48.6101 52.1899 22.3275 50.0483 32.6852 51.3111 37.9573 45.3399 8.8960 12.5004
temp: 298.150 k
press: 1.00000 atm
elementType: 8 8 6 6 6 6 6 6 6 6 6 6 6 6 6 6 6 1 1 1 1 1 1 1 1 1 1 1 1 1 1 1 1 1 1 1 1 1 1 1 1
symmnumber: 1
zpe: 931740.1 jmol-1
zpe.correction: 0.354881 hartree
zpe.thermalcorrener: 0.374181 hartree
zpe.thermalcorrenthalpy: 0.375125 hartree
zpe.thermalcorrgfe: 0.303592 hartree
zpe.sumelectzpe: -735.084682 hartree
zpe.sumelectthermal: -735.065382 hartree
zpe.sumelectthermalent: -735.064438 hartree
zpe.sumelectthermalfe: -735.135971 hartree
dipole: -1.7993 -0.8759 1.0770
dipole: 2.2726
quadrupole: -108.9488 -102.6209 -106.1312
quadrupole: -14.0631 5.6281 3.1827
quadrupole: -3.0485 3.2794 -0.2309 -14.0631 5.6281 3.1827
hfenergy: -735.4395633 hartree
pointgroup: C01 [X(C15H24O2)]
dipole: -0.7125083 0.3039587 -0.4464888 debye
polarizability: 241.6970554|17.5418568|155.1160043|9.8784028|-0.0439596|119.3954465 unknown
InChI: InChI=1S/C15H24O2/c1-12(2)5-4-6-14-7-9-15(10-8-14)11-17-13(3)16/h5,7,15H,4,6,8-11H2,1-3H3
charge 0 multiplicity 1
41 atoms
O  4.343621 0.260475 -0.267676
O  6.032201 -0.946308 0.79214
C  1.976899 -0.337017 -0.328235
C  0.919603 -1.418249 0.01069
C  -0.45281 -1.055759 -0.600303
C  1.546999 1.026157 0.268396
C  -0.845763 0.398461 -0.357292
C  0.075308 1.321127 0.037874
C  3.356225 -0.774497 0.167802
C  -2.306395 0.761378 -0.579609
C  -3.249762 0.261084 0.564556
C  -4.692127 0.659778 0.330854
C  -5.77223 -0.148971 0.123465
C  5.670157 0.045687 0.119235
C  -7.154958 0.443004 -0.106576
C  -5.726767 -1.667337 0.103286
C  6.557022 1.163524 -0.387514
H  2.023141 -0.234494 -1.431884
H  0.822128 -1.49616 1.112791
H  1.246348 -2.410682 -0.358322
H  -1.231838 -1.729517 -0.190489
H  -0.439414 -1.246118 -1.695125
H  2.168615 1.83237 -0.165378
H  1.763808 1.035832 1.360222
H  -0.25081 2.358873 0.203529
H  3.664301 -1.747367 -0.258778
H  3.39479 -0.852805 1.271347
H  -2.414845 1.859932 -0.667649
H  -2.668305 0.326695 -1.53427
H  -3.150551 -0.834156 0.673591
H  -2.88969 0.705636 1.514945
H  -4.867219 1.74818 0.31439
H  -7.564099 0.129606 -1.088131
H  -7.138618 1.546425 -0.078133
H  -7.87208 0.089947 0.661532
H  -6.377009 -2.08775 0.896418
H  -6.114354 -2.055083 -0.859942
H  -4.712366 -2.072824 0.248114
H  6.224463 2.13035 0.028804
H  6.485979 1.237916 -1.486342
H  7.598702 0.971754 -0.093136
