program: Gaussian 09
title: 000103885
version: EM64L-G09RevD.01
frameworkgroup: C1[X(C21H25N2)]
method: RPBEPBE
basis: SDD
operation: Freq
keyword: #p
keyword: freq=noraman
keyword: PBEPBE/SDD
title: #p freq=noraman PBEPBE/SDD
converged: YES YES NO NO
title: Mulliken charges:
elementType: N N C C C C C C C C C C C C C C C C C C C C C H H H H H H H H H H H H H H H H H H H H H H H H H
charge: -0.200107 -0.133139 -0.061330 0.335592 0.363805 0.237484 -0.679097 -0.676748 -0.410303 -0.302274 -0.353872 -0.658809 -0.235305 -0.218509 -0.294690 0.518302 -0.386878 -0.406720 0.405170 -0.338626 -0.352647 -0.640098 -0.638804 0.242632 0.239193 0.217283 0.241973 0.221504 0.236269 0.254616 0.222753 0.249064 0.257846 0.257691 0.265501 0.249069 0.249445 0.242623 0.230062 0.236189 0.257073 0.259339 0.254061 0.253929 0.240410 0.254583 0.254673 0.239820
chargesum: 1.00000
title: Mulliken charges with hydrogens summed into heavy atoms:
elementType: N N C C C C C C C C C C C C C C C C C C C C C
charge: -0.200107 -0.133139 -0.061330 0.335592 0.363805 0.237484 0.020011 0.022999 -0.155686 -0.079521 -0.104808 0.122228 0.013764 0.030936 -0.052067 0.518302 -0.156816 -0.170532 0.405170 -0.081553 -0.093308 0.108302 0.110272
polarizability: 7.49761538e+02 1.29928604e+01 2.27984337e+02 6.15706300e-01 -3.33400502e+00 1.24318274e+02
1716.lowfreq: -6.1525 -0.0006 0.0003 0.0011 0.9393 10.1233 22.1534 24.7883 39.8895
frequency: 22.0878 24.7303 39.8830 56.7376 70.3895 88.9966 113.2485 140.6387 142.1416 148.3919 159.5026 175.0851 179.8331 207.0404 216.1055 237.5261 249.1891 256.1899 265.1120 280.1916 308.2893 325.7560 346.4120 354.1872 381.0135 389.6497 410.9364 429.9719 467.9691 483.2767 504.9189 519.2935 536.5671 543.6886 565.2910 575.6623 615.2311 630.0417 684.5366 696.0353 726.1086 745.1234 754.9134 766.5416 768.2919 802.0036 826.0694 832.0739 869.4639 874.3041 905.3846 931.5815 932.5775 941.5541 945.7391 950.7421 969.9787 976.6531 984.6468 995.3667 1009.3744 1014.4844 1027.5394 1052.6333 1065.0215 1092.8956 1115.0406 1116.1808 1124.9868 1127.6657 1131.4218 1138.4983 1165.7063 1180.3765 1185.9466 1208.8828 1213.8453 1236.8771 1243.5825 1262.6340 1289.7058 1294.1907 1309.2063 1336.2184 1368.6327 1383.3691 1388.8799 1393.9170 1403.8790 1409.8695 1434.3567 1438.9025 1450.5484 1456.0280 1459.5708 1462.6632 1462.9769 1469.1852 1475.4716 1476.4070 1480.3039 1483.1392 1485.3761 1487.7930 1492.6269 1499.5477 1519.7822 1529.0462 1550.3582 1593.8499 1609.7899 1622.2219 1643.5694 2976.6255 2981.4224 2990.8513 2992.4508 2996.9883 3055.6262 3058.2661 3089.1431 3089.3135 3093.8104 3098.0793 3101.5643 3124.0089 3125.3719 3127.4771 3128.1744 3134.1447 3140.9829 3142.4915 3144.2410 3150.8691 3163.0508 3179.0555 3179.4560 3181.9775
redmass: 3.1292 4.4806 4.0869 3.7908 1.9584 3.5438 2.9722 1.3267 3.0134 3.6678 1.9667 3.3268 1.4415 1.2040 1.4109 1.4172 2.4738 1.9664 2.7820 2.4174 2.6138 2.5611 4.1425 2.9730 3.6113 3.0660 4.3532 2.8473 3.4158 3.7057 4.0433 2.2890 4.5432 4.3201 3.5098 4.3983 3.8445 6.2591 4.6959 5.3557 4.8549 3.7216 2.6478 1.7132 3.1742 1.2898 3.5412 1.9298 1.3819 1.8086 3.0250 2.8634 2.9089 1.4925 1.2341 1.3814 1.3509 1.3685 3.0068 1.3396 1.3121 2.7254 2.2288 1.5848 2.7425 1.2334 1.4517 1.3518 1.7845 2.6682 1.7570 1.7296 1.6821 1.4269 1.8037 1.2945 1.9317 2.5731 2.8060 1.4378 2.3365 1.8856 1.6101 1.4260 2.5934 1.1668 2.8294 2.0667 1.8245 2.7045 1.1549 1.3649 2.2493 1.3414 1.0488 1.5253 1.1580 1.0399 1.4721 1.1163 1.0976 1.1293 1.0445 1.1901 1.9202 1.3558 2.3179 5.0031 3.7661 4.2725 7.0509 7.2898 6.3497 1.0365 1.0385 1.0346 1.0350 1.0367 1.1005 1.1033 1.1009 1.1006 1.1001 1.1015 1.1011 1.0983 1.0914 1.0966 1.0910 1.0963 1.0877 1.0886 1.0872 1.0893 1.0945 1.0936 1.1003 1.0947
irintensity: 0.1163 0.3084 0.3970 1.6325 0.0442 0.2741 0.4114 1.6481 1.9926 3.2440 1.0232 0.3115 0.1724 0.6487 0.1403 0.4069 0.4094 1.9023 0.3794 3.8582 2.2052 3.7275 2.6730 1.8612 1.6446 2.9711 0.7261 1.3672 10.7895 3.7327 24.7201 12.1329 2.7725 1.8826 2.1552 3.9073 1.8763 0.9908 7.6790 0.1267 61.8144 3.4773 12.9128 64.1271 9.2638 0.3847 11.9711 64.3829 0.0504 7.2156 7.3498 87.6896 6.1489 0.1901 36.8689 1.4775 1.0932 14.6223 0.0407 0.0990 1.6491 36.1798 1.1030 21.2990 10.7952 0.0058 2.5935 0.6740 56.7445 3.4807 10.5802 2.7168 6.9306 27.5388 4.2704 172.3764 164.9251 13.2192 23.4978 11.3799 52.0395 59.7516 32.5178 60.8445 24.0645 14.2803 778.9507 0.5341 53.1352 16.5800 8.9162 6.1188 79.8642 33.8440 3.1838 23.7942 12.0370 0.0702 2.2817 19.6443 14.1396 8.4367 35.4366 18.5029 4.3504 156.0477 3.8600 15.8568 931.6854 1694.5590 1.1657 167.4749 77.3269 40.3696 132.4937 14.1975 15.3334 10.5790 0.5764 39.2071 7.4085 2.8763 33.9957 10.6814 20.3599 2.5429 0.0850 11.0867 5.9198 28.6131 1.6324 3.0396 10.1814 1.4815 9.3076 8.4805 18.9069 10.5512
temp: 298.150 k
press: 1.00000 atm
elementType: 7 7 6 6 6 6 6 6 6 6 6 6 6 6 6 6 6 6 6 6 6 6 6 1 1 1 1 1 1 1 1 1 1 1 1 1 1 1 1 1 1 1 1 1 1 1 1 1
symmnumber: 1
zpe: 1068631.8 jmol-1
zpe.correction: 0.407020 hartree
zpe.thermalcorrener: 0.429668 hartree
zpe.thermalcorrenthalpy: 0.430612 hartree
zpe.thermalcorrgfe: 0.354681 hartree
zpe.sumelectzpe: -922.865638 hartree
zpe.sumelectthermal: -922.842990 hartree
zpe.sumelectthermalent: -922.842046 hartree
zpe.sumelectthermalfe: -922.917977 hartree
dipole: 4.3738 -0.9259 -0.1897
dipole: 4.4748
quadrupole: -0.8645 -105.0950 -140.4901
quadrupole: 3.9654 0.3893 -0.7806
quadrupole: 81.2853 -22.9451 -58.3402 3.9654 0.3893 -0.7806
hfenergy: -923.272658 hartree
pointgroup: C01 [X(C21H25N2)]
dipole: -1.7125505 -0.4063427 0.037854 debye
polarizability: 749.9830218|-2.0289414|224.5771363|-7.5961396|17.9519721|127.5039915 unknown
InChI: InChI=1S/C21H25N2/c1-21(2)18-8-6-7-9-19(18)23(5)20(21)15-12-16-10-13-17(14-11-16)22(3)4/h6-15H,1-5H3
charge 1 multiplicity 1
48 atoms
N  2.374316 -1.025105 -0.028465
N  -6.454096 0.0186 0.065698
C  2.56584 1.342023 0.106066
C  3.937457 0.685692 -0.018158
C  1.621731 0.120208 0.059388
C  3.778301 -0.717246 -0.102243
C  2.419247 2.097423 1.463516
C  2.282331 2.307176 -1.084209
C  5.222862 1.245996 -0.05522
C  0.212314 0.262521 0.11281
C  4.866575 -1.598479 -0.234415
C  1.879218 -2.409023 0.018277
C  6.338792 0.379459 -0.182165
C  6.159641 -1.022577 -0.272045
C  -0.795959 -0.681515 -0.136526
C  -2.212271 -0.45824 -0.067409
C  -2.816996 0.780559 0.34144
C  -3.103879 -1.528283 -0.422688
C  -5.085924 -0.139774 0.024196
C  -4.197784 0.940107 0.388207
C  -4.487926 -1.386681 -0.382893
C  -7.051984 1.305846 0.480278
C  -7.349814 -1.096764 -0.307892
H  2.605582 1.428296 2.320915
H  3.151132 2.922672 1.505853
H  1.410613 2.534663 1.569332
H  2.382653 1.791632 -2.054599
H  1.265237 2.73164 -1.016617
H  3.002776 3.143214 -1.062382
H  5.371907 2.329006 0.010257
H  -0.105021 1.287524 0.336167
H  4.745883 -2.682591 -0.317197
H  2.701407 -3.077088 0.313018
H  1.496786 -2.733666 -0.966046
H  1.079393 -2.495127 0.772123
H  7.349911 0.796862 -0.215057
H  7.03301 -1.674014 -0.376034
H  -0.510741 -1.690449 -0.456654
H  -2.187938 1.628389 0.632808
H  -2.678798 -2.488948 -0.739176
H  -4.608605 1.900371 0.708792
H  -5.117268 -2.23324 -0.666137
H  -6.742915 2.128009 -0.191845
H  -6.766594 1.567785 1.516304
H  -8.147647 1.227585 0.439394
H  -7.197732 -1.972215 0.350707
H  -7.186996 -1.409138 -1.356392
H  -8.395526 -0.773296 -0.207482
