program: Gaussian 09
title: 000103888
version: EM64L-G09RevD.01
frameworkgroup: C1[X(C21H26N2)]
method: RPBEPBE
basis: SDD
operation: Freq
keyword: #pfreq=noraman
keyword: PBEPBE/SDD
title: #p freq=noraman PBEPBE/SDD
converged: YES YES NO NO
title: Mulliken charges:
elementType: N N C C C C C C C C C C C C C C C C C C C C C H H H H H H H H H H H H H H H H H H H H H H H H H H
charge: -0.202187 -0.150877 0.186429 -0.211785 0.269271 0.280133 -0.761851 -0.753791 -0.180029 -0.430541 -0.663079 -0.402542 -0.274204 -0.224050 -0.402373 0.546396 -0.432176 -0.439186 -0.358071 -0.375903 0.398880 -0.647474 -0.645929 0.209889 0.220348 0.224916 0.234959 0.220618 0.226804 0.208458 0.242144 0.229917 0.247935 0.225736 0.210170 0.229966 0.217838 0.215395 0.223458 0.222287 0.223491 0.234588 0.235325 0.216717 0.234521 0.234331 0.234314 0.234367 0.216447
chargesum: 0.00000
title: Mulliken charges with hydrogens summed into heavy atoms:
elementType: N N C C C C C C C C C C C C C C C C C C C C C
charge: -0.202187 -0.150877 0.186429 -0.001896 0.269271 0.280133 -0.081627 -0.097911 0.062115 -0.200624 0.020762 -0.172577 -0.056366 -0.008654 -0.178916 0.546396 -0.209889 -0.215695 -0.123483 -0.140577 0.398880 0.038095 0.039199
polarizability: 4.63762882e+02 7.52447111e-01 1.87179768e+02 -4.10480454e+00 2.65068003e+00 1.82201330e+02
1716.lowfreq: -12.7720 -3.7953 -0.0007 -0.0002 0.0005 4.6220 20.1843 24.9665 27.8976
frequency: 20.1054 24.7267 27.8722 57.5958 71.5448 73.0844 94.4524 115.2989 122.4954 148.1264 152.9084 164.6154 181.6550 194.8040 212.1716 228.1961 234.7802 250.2010 271.1700 279.2537 289.2642 308.8282 326.4256 333.4818 376.3188 379.0472 395.1341 422.6872 463.5214 479.5342 494.3371 517.3366 526.1721 537.0790 567.0353 574.8046 587.2544 610.2958 638.3455 701.3331 728.2303 737.1580 744.1913 755.6358 770.0632 804.8703 810.7778 821.4682 844.5609 851.3290 874.4734 923.0674 936.6588 941.7983 942.3890 945.0120 955.0895 960.5666 963.1946 984.1582 995.7849 1006.4362 1019.1091 1055.4191 1058.2463 1097.8944 1108.3850 1109.6607 1111.8164 1117.8821 1126.4863 1141.4903 1148.7180 1164.9532 1170.5263 1180.8966 1200.1855 1213.3156 1233.4137 1253.2389 1256.1218 1261.4949 1282.1502 1288.9491 1294.9137 1329.0754 1339.7693 1351.1916 1363.6917 1371.1124 1384.1753 1390.4056 1408.5170 1428.3350 1431.1720 1444.3085 1450.3998 1458.5380 1462.7112 1463.1878 1464.8399 1472.3913 1474.6509 1478.4107 1481.6842 1483.7732 1492.2011 1495.6121 1505.0802 1529.9200 1556.5729 1596.5076 1619.6206 1631.8974 1655.3003 2866.2613 2906.2676 2937.0306 2945.1934 2971.3587 2975.2220 3002.0406 3004.8569 3028.4787 3064.3886 3065.5093 3072.5882 3074.2165 3080.6047 3087.1935 3094.2649 3104.5940 3105.2711 3113.3623 3115.5893 3124.2580 3129.7870 3144.0236 3159.2913 3161.5036 3165.5572
redmass: 3.4968 3.7492 4.4233 4.0806 3.6015 2.4042 1.8236 3.2865 3.3762 1.9224 1.4097 3.0441 2.4523 1.1301 1.1883 2.0615 2.6633 2.4026 1.4865 2.7035 1.7115 2.7322 3.0718 3.1108 3.6631 3.5481 4.3410 3.0293 3.4413 3.3516 3.7070 2.3117 3.8391 4.7192 3.6623 3.9100 3.0749 4.2454 6.5337 4.6454 3.6119 3.4667 1.3093 3.6864 4.1514 1.3568 2.2556 2.3299 1.4579 2.9873 2.2813 1.4028 1.4779 2.6801 1.4520 2.5872 1.3765 1.6373 1.7341 1.1906 2.8621 1.4043 2.1983 1.4932 3.0841 2.0876 1.2493 1.3090 1.3953 1.5251 1.7076 2.7634 2.0328 1.7010 1.1558 1.9542 1.1862 2.2751 1.3470 3.0667 1.9761 2.8171 1.6230 1.7359 1.4166 1.4056 2.8765 1.7996 3.3734 1.2015 3.1327 1.2426 3.6702 1.3272 1.3234 2.4200 2.0869 1.2236 1.0732 1.0411 1.0523 1.1264 1.0461 1.0715 1.0956 1.0992 1.0989 2.4564 1.1092 2.6655 6.2830 7.0391 7.0892 6.0941 6.1180 1.0823 1.0518 1.0368 1.0394 1.0349 1.0349 1.0993 1.1029 1.0808 1.0926 1.0959 1.0994 1.1002 1.0999 1.0988 1.0961 1.0939 1.0889 1.0892 1.0860 1.0888 1.0876 1.0932 1.0998 1.0931 1.0938
irintensity: 0.0654 0.4628 0.1012 1.7542 0.6016 0.2357 3.7345 0.9902 6.6780 0.4073 0.4708 0.1940 0.7410 0.0032 0.0788 0.8575 3.1696 1.9642 4.3689 2.2768 2.0892 5.0894 0.1152 6.0370 4.3196 0.4336 0.4794 0.1215 0.7486 14.5908 6.9005 15.7403 5.5577 5.6478 0.8104 0.7398 2.8349 15.2366 0.9501 0.1801 5.2858 10.2140 81.2563 16.2030 13.6208 5.5135 25.7024 43.7315 3.3275 12.3909 2.2279 2.5264 3.7520 2.1434 8.1864 48.5276 0.9814 13.1664 19.3181 36.6861 0.5568 8.5874 39.2460 25.9140 2.4784 89.9063 0.1662 0.8957 0.5132 15.4162 4.6338 20.9751 36.5108 12.3933 4.1627 7.0868 71.2803 16.4416 6.8566 1.9824 22.4312 31.4917 63.3503 9.4917 4.0305 8.1509 62.9976 20.3198 177.1674 22.2042 8.7688 13.7936 13.7747 10.3406 52.6873 11.7550 10.2367 20.8986 14.5035 0.2782 1.3404 34.5725 21.3181 11.8065 11.9344 0.4197 3.9310 175.6916 44.6563 304.1041 3.7263 0.4652 153.3432 348.6872 10.6913 52.2500 113.6433 111.7947 143.8526 27.1897 26.8624 4.4339 87.2988 33.9160 30.1161 3.9078 69.5431 24.4118 29.7185 13.4262 4.4656 57.9092 17.4584 21.2787 6.5161 14.4666 11.0158 35.8519 40.9399 28.4012 14.4969
temp: 298.150 k
press: 1.00000 atm
elementType: 7 7 6 6 6 6 6 6 6 6 6 6 6 6 6 6 6 6 6 6 6 6 6 1 1 1 1 1 1 1 1 1 1 1 1 1 1 1 1 1 1 1 1 1 1 1 1 1 1
symmnumber: 1
zpe: 1089554.2 jmol-1
zpe.correction: 0.414989 hartree
zpe.thermalcorrener: 0.438195 hartree
zpe.thermalcorrenthalpy: 0.439139 hartree
zpe.thermalcorrgfe: 0.361403 hartree
zpe.sumelectzpe: -923.631320 hartree
zpe.sumelectthermal: -923.608115 hartree
zpe.sumelectthermalent: -923.607171 hartree
zpe.sumelectthermalfe: -923.684907 hartree
dipole: 5.9070 0.3511 -0.0097
dipole: 5.9174
quadrupole: -109.5944 -136.6648 -134.2412
quadrupole: 0.0648 3.9646 0.4649
quadrupole: 17.2391 -9.8314 -7.4077 0.0648 3.9646 0.4649
hfenergy: -924.0463097 hartree
pointgroup: C01 [X(C21H26N2)]
dipole: -2.3235445 0.123732 -0.0767751 debye
polarizability: 463.80174|-2.2832985|184.0698594|-1.1080885|-3.6041286|185.272381 unknown
InChI: InChI=1S/C21H26N2/c1-21(2)18-8-6-7-9-19(18)23(5)20(21)15-12-16-10-13-17(14-11-16)22(3)4/h6-15,20H,1-5H3
charge 0 multiplicity 1
49 atoms
N  2.491814 1.066654 -0.54254
N  -6.460857 -0.125789 -0.379657
C  2.521277 -1.105697 0.522013
C  1.673415 0.233938 0.401138
C  3.935032 -0.577097 0.243859
C  3.839197 0.682923 -0.416074
C  2.143269 -2.127907 -0.588366
C  2.341255 -1.746713 1.913484
C  0.245218 0.079409 -0.048357
C  5.185569 -1.169883 0.45989
C  2.105809 2.449256 -0.818235
C  4.998534 1.366054 -0.8502
C  6.362174 -0.49602 0.027731
C  6.258431 0.756313 -0.621137
C  -0.827881 0.359023 0.750528
C  -2.255936 0.215262 0.4278
C  -2.739576 -0.278335 -0.81843
C  -3.235117 0.585636 1.391962
C  -4.111048 -0.391527 -1.089273
C  -4.613543 0.478677 1.142327
C  -5.092505 -0.014158 -0.113354
C  -6.919593 -0.635764 -1.677531
C  -7.441019 0.27025 0.638481
H  1.681061 0.716651 1.410395
H  2.837861 -2.986918 -0.55786
H  1.115186 -2.508162 -0.443578
H  2.214268 -1.667894 -1.590401
H  2.676762 -1.064769 2.715768
H  1.277719 -1.996783 2.087987
H  2.924997 -2.682385 1.994839
H  0.105445 -0.282564 -1.076166
H  5.262932 -2.140893 0.964407
H  1.009962 2.503863 -0.929733
H  2.562205 2.792358 -1.764431
H  2.4117 3.153599 -0.010413
H  4.936515 2.341318 -1.344363
H  7.346812 -0.943581 0.201006
H  7.16872 1.273131 -0.948033
H  -0.615077 0.738368 1.763444
H  -2.027583 -0.582958 -1.594207
H  -2.90264 0.968912 2.365614
H  -4.425555 -0.776964 -2.063398
H  -5.317267 0.778331 1.923877
H  -8.020665 -0.652686 -1.696216
H  -6.560823 -1.668489 -1.865162
H  -6.574956 0.001945 -2.517297
H  -7.342322 1.341122 0.911125
H  -7.335929 -0.327858 1.566847
H  -8.459046 0.113002 0.24869
