program: Gaussian 09
title: 000103851
version: EM64L-G09RevD.01
frameworkgroup: C1[X(C13H24O)]
method: RPBEPBE
basis: SDD
operation: Freq
keyword: #pfreq=noraman
keyword: PBEPBE/SDD
title: #p freq=noraman PBEPBE/SDD
converged: YES YES NO NO
title: Mulliken charges:
elementType: O C C C C C C C C C C C C C H H H H H H H H H H H H H H H H H H H H H H H H
charge: -0.439821 -0.412483 -0.423178 -0.043727 -0.560682 0.452754 -0.339896 -0.458134 -0.713092 -0.843961 -0.263685 0.376038 -0.784311 -0.796060 0.209491 0.192377 0.224602 0.199785 0.211975 0.200921 0.209156 0.210227 0.207899 0.204913 0.200531 0.240345 0.214694 0.216863 0.241159 0.223605 0.202357 0.321545 0.227021 0.212374 0.216606 0.222841 0.217827 0.221123
chargesum: 0.00000
title: Mulliken charges with hydrogens summed into heavy atoms:
elementType: O C C C C C C C C C C C C C
charge: -0.118276 -0.010614 0.001209 0.168248 -0.150605 0.452754 -0.129669 -0.045321 -0.057522 -0.162335 -0.061328 0.376038 -0.128310 -0.134270
polarizability: 1.73888741e+02 1.72554677e+00 1.42267409e+02 -1.22566604e+01 3.19871068e+00 1.28295168e+02
1716.lowfreq: -14.7918 -5.3804 -0.0007 -0.0004 0.0003 5.1389 14.3847 23.2844 28.5185
frequency: 11.1059 22.5249 28.3973 46.3109 54.5396 69.6610 113.3451 116.8903 140.2072 145.9475 175.9220 190.4696 216.3142 222.4195 275.4245 290.8407 307.6079 313.7623 343.1550 378.9446 395.2888 426.3353 444.4692 455.7673 480.2572 493.5735 531.5597 554.1430 729.5608 769.4026 789.9273 808.2142 821.9329 848.7302 894.7801 908.8673 929.7148 948.1492 948.8121 986.9763 993.2865 995.6281 1020.3161 1031.7085 1036.8646 1046.4661 1081.3790 1082.9709 1088.6365 1117.3786 1130.6080 1155.2563 1159.2507 1197.9175 1225.8969 1232.2783 1242.5860 1261.9062 1300.3537 1304.8185 1313.8242 1330.0872 1348.9202 1360.9427 1369.7411 1370.6861 1385.6472 1386.9309 1392.1586 1397.6604 1448.7828 1453.2622 1454.8977 1458.9360 1463.0911 1466.3653 1467.4281 1470.2523 1471.6302 1473.3350 1476.6864 1481.7389 1688.2380 1697.1349 2944.0338 2952.4670 2955.5815 2959.8678 2961.7638 2963.6733 2969.9155 2970.2092 3012.1614 3014.8140 3026.0720 3028.1380 3028.9840 3033.3522 3039.6975 3040.2127 3058.2364 3067.2965 3067.9442 3079.4828 3086.4382 3088.5765 3089.6396 3537.7869
redmass: 3.5283 2.8930 3.1376 2.8831 3.3596 3.2598 2.3345 1.0986 1.2337 1.7631 1.5774 2.6642 1.9248 1.1947 2.2872 2.3672 2.2700 1.1062 2.4519 2.4092 2.2815 2.8332 2.4612 2.4276 2.2589 2.7076 3.0080 2.3814 1.7968 1.8049 2.4382 1.5135 1.8334 1.5840 1.9055 1.8805 1.7977 1.4045 1.5893 1.8264 1.7131 1.4428 1.8417 2.9887 1.5452 1.5808 1.6652 1.4964 2.5879 1.7611 1.9955 1.7638 1.5619 1.2615 1.8849 1.8747 1.3433 1.3244 1.2704 1.3681 1.3250 1.5091 1.5578 1.4802 1.2679 1.2423 1.2294 1.2927 1.3158 1.2295 1.0825 1.0656 1.0649 1.0862 1.0757 1.0575 1.0620 1.0472 1.0497 1.0735 1.0725 1.0753 7.0294 6.5634 1.0628 1.0625 1.0373 1.0580 1.0426 1.0430 1.0586 1.0419 1.0912 1.0964 1.0970 1.0891 1.0964 1.0967 1.0936 1.0959 1.0908 1.0961 1.0916 1.0968 1.0959 1.0958 1.0994 1.0657
irintensity: 0.5708 0.1532 1.2766 0.2302 0.2913 0.3867 0.4489 1.1570 0.5670 2.7604 1.2461 4.9014 0.8221 1.8865 2.0675 0.3804 19.5145 139.9791 3.4684 2.4900 6.1021 5.3470 8.0004 19.7224 0.3832 2.5872 5.6852 8.3677 3.4548 1.8323 7.1116 11.1563 18.0145 22.9513 5.3415 11.2913 2.6878 0.1627 5.6725 3.3096 2.3456 6.3074 17.4469 24.8681 7.4485 12.0457 4.8892 31.1542 18.9945 22.8121 11.5688 27.5457 5.4958 1.4070 0.6700 4.7071 4.9885 4.4458 3.0845 0.1813 4.6584 1.1779 9.1887 1.2363 13.0319 15.8619 19.6419 20.9964 22.7491 12.6714 0.6452 6.9603 5.0284 3.3388 5.2280 16.2399 12.7573 28.7867 13.2102 13.5572 9.8333 5.4144 1.7275 3.7491 16.6315 18.9318 34.2300 102.1938 22.9072 58.2375 6.5065 42.2529 12.4451 8.3837 2.0390 6.0498 61.7309 29.0054 36.8997 4.2335 30.7475 44.3103 69.0162 50.8396 42.0814 37.0213 32.5919 4.1666
temp: 298.150 k
press: 1.00000 atm
elementType: 8 6 6 6 6 6 6 6 6 6 6 6 6 6 1 1 1 1 1 1 1 1 1 1 1 1 1 1 1 1 1 1 1 1 1 1 1 1
symmnumber: 1
zpe: 884880.6 jmol-1
zpe.correction: 0.337033 hartree
zpe.thermalcorrener: 0.355755 hartree
zpe.thermalcorrenthalpy: 0.356699 hartree
zpe.thermalcorrgfe: 0.286989 hartree
zpe.sumelectzpe: -583.822717 hartree
zpe.sumelectthermal: -583.803995 hartree
zpe.sumelectthermalent: -583.803051 hartree
zpe.sumelectthermalfe: -583.872761 hartree
dipole: 0.0070 -1.4392 -0.7071
dipole: 1.6035
quadrupole: -85.3709 -91.9900 -84.7401
quadrupole: -5.6618 -6.6166 -3.6475
quadrupole: 1.9961 -4.6230 2.6269 -5.6618 -6.6166 -3.6475
hfenergy: -584.1597499 hartree
pointgroup: C01 [X(C13H24O1)]
dipole: 0.0008985 -0.6044415 0.1807244 debye
polarizability: 173.1307416|0.2218521|142.9272589|-13.7004285|-0.7173371|128.3933183 unknown
InChI: InChI=1S/C13H24O/c1-11(2)7-5-8-12(3)9-6-10-13(4)14/h7,9,13-14H,5-6,8,10H2,1-4H3
charge 0 multiplicity 1
38 atoms
O  -4.212039 1.890344 0.398243
C  -3.202482 -0.383809 0.216516
C  -1.817736 0.137533 -0.247077
C  -4.365269 0.542318 -0.203198
C  1.436036 -2.009719 0.489691
C  0.365428 -1.265181 -0.30283
C  -0.669506 -0.653348 0.343187
C  2.887167 -1.46909 0.283581
C  -5.747898 -0.046063 0.129259
C  0.557175 -1.258994 -1.809439
C  3.042783 -0.026742 0.720779
C  3.645024 1.000846 0.055646
C  3.700136 2.39505 0.661965
C  4.308016 0.880835 -1.306304
H  -3.374705 -1.398034 -0.195396
H  -3.210639 -0.490175 1.323188
H  -1.740472 1.200266 0.063934
H  -1.780686 0.138214 -1.352835
H  -4.296549 0.752301 -1.286545
H  1.432675 -3.082632 0.199381
H  1.190917 -1.969442 1.569264
H  -0.686341 -0.723347 1.444115
H  3.188039 -1.602977 -0.771543
H  3.568005 -2.113666 0.880183
H  -5.830184 -0.276443 1.210027
H  -6.543304 0.672569 -0.134126
H  -5.925362 -0.984558 -0.428045
H  0.801995 -2.274411 -2.178914
H  1.401067 -0.600238 -2.095499
H  -0.335257 -0.904947 -2.351003
H  2.599405 0.199011 1.70447
H  -4.29057 1.79653 1.383103
H  3.21342 2.430082 1.652112
H  4.747505 2.73902 0.779843
H  3.196791 3.133553 0.006025
H  4.220699 -0.126654 -1.745241
H  3.86837 1.606407 -2.019579
H  5.387447 1.123589 -1.236337
