program: Gaussian 09
title: 000103844
version: EM64L-G09RevD.01
frameworkgroup: C1[X(C13H19NO)]
method: RPBEPBE
basis: SDD
operation: Freq
keyword: #p
keyword: freq=noraman
keyword: PBEPBE/SDD
title: #p freq=noraman PBEPBE/SDD
converged: YES YES NO NO
title: Mulliken charges:
elementType: O N C C C C C C C C C C C C C H H H H H H H H H H H H H H H H H H H
charge: -0.426296 -0.185092 -0.059283 -0.446103 -0.571553 0.268224 0.375551 -0.458039 -0.705013 -0.541035 -0.424997 0.475486 -0.317873 -0.467074 -0.825257 0.225713 0.237093 0.198272 0.227204 0.216753 0.217599 0.222266 0.236218 0.209878 0.211301 0.217868 0.221875 0.252296 0.187692 0.226984 0.222085 0.219187 0.229228 0.328843
chargesum: 0.00000
title: Mulliken charges with hydrogens summed into heavy atoms:
elementType: O N C C C C C C C C C C C C C
charge: -0.097453 -0.185092 0.166430 -0.010738 -0.127596 0.268224 0.375551 -0.018174 -0.047616 -0.323167 -0.203122 0.475486 0.122115 -0.240090 -0.154757
polarizability: 1.95625459e+02 5.44686994e+00 1.56985961e+02 -7.03392913e+00 1.24507208e+01 1.01640546e+02
1716.lowfreq: -12.9250 -8.8390 -0.0004 0.0003 0.0005 11.6495 16.3833 43.8002 50.9413
frequency: -8.2154 43.3511 50.7305 71.2067 106.9671 132.1146 175.3867 209.4020 217.4145 251.0110 269.9961 299.8353 324.2128 347.2581 389.5307 398.9724 410.5163 453.1173 477.1233 494.1145 513.2683 525.7138 594.1058 624.6262 691.7247 709.4847 738.1233 799.4540 800.8583 831.1070 841.4625 861.6271 900.2731 923.2517 936.3777 942.5716 974.8014 989.1394 1003.5284 1025.9761 1035.7916 1044.0745 1050.7426 1092.9502 1116.5378 1142.0687 1156.6680 1179.6245 1190.0098 1200.7952 1220.8577 1227.9115 1268.5062 1276.7984 1309.4787 1312.2574 1331.0683 1336.9983 1353.7447 1361.8765 1372.0576 1377.9195 1384.9395 1386.5378 1393.7522 1440.6171 1458.1542 1463.1006 1467.2103 1471.8647 1472.7047 1473.0690 1481.7957 1485.7210 1514.0322 1583.9490 1620.7152 2941.9759 2961.6930 2969.2829 2969.8408 2978.2333 2990.2365 3004.4942 3018.4591 3030.3808 3048.5753 3059.7986 3068.3532 3079.3230 3090.4817 3096.9839 3106.3468 3135.1303 3141.2795 3549.2534
redmass: 1.0200 3.8189 4.0130 4.6425 3.1278 2.4751 3.1988 1.6804 2.4853 1.8962 2.6586 1.3692 2.2569 2.1539 3.9799 2.4589 3.2406 2.9572 2.6070 3.0948 3.6491 2.7874 3.5964 2.4207 5.0346 3.1526 2.9692 1.3942 2.2358 2.5359 1.4810 2.9232 2.0017 1.6924 1.6379 1.9175 1.9531 1.8039 1.6577 1.6067 2.4531 1.5695 2.0141 1.8076 1.9838 1.5771 1.4448 1.5696 1.7038 1.4988 2.1025 1.8517 1.4528 1.6372 1.4395 1.4948 1.3067 1.4617 1.4503 1.3175 1.2122 3.1674 1.3600 2.1835 1.2342 2.2662 1.0866 1.0817 1.0824 1.0597 1.0807 1.0700 1.3090 1.0867 3.0045 6.2166 6.6236 1.0685 1.0657 1.0511 1.0481 1.0367 1.0738 1.0722 1.1011 1.0928 1.0959 1.1035 1.0993 1.0989 1.0989 1.0941 1.0875 1.0902 1.0947 1.0663
irintensity: 0.2796 0.5428 0.8585 5.8196 1.8793 6.4200 1.0015 1.0585 1.5014 0.5681 12.4906 120.9281 28.5559 28.4538 2.6847 11.6015 3.9005 4.0403 6.1798 1.3540 4.9433 10.8860 13.8422 3.0352 1.6864 0.1161 0.2658 28.5070 21.6864 0.6253 10.4414 11.9271 5.5664 0.2834 0.6307 14.7076 49.9265 35.1161 16.5005 19.9825 3.1612 22.5891 5.5366 2.1093 9.5418 5.5962 10.5988 16.0972 26.3501 25.4106 20.9331 0.2481 36.9665 18.2247 9.4517 60.7026 9.8555 1.0262 24.3663 26.9947 23.4395 3.8517 29.0902 9.1491 8.0967 31.0045 4.0641 3.7187 8.3545 15.1563 0.4963 18.7142 55.9338 10.5456 117.0348 37.0917 122.4864 57.1594 43.6930 41.9396 86.4838 35.6832 14.7332 42.8363 34.1213 39.7146 26.0504 29.5830 48.7446 22.7267 38.3081 26.0769 18.2418 41.1047 10.0535 4.3681
temp: 298.150 k
press: 1.00000 atm
elementType: 8 7 6 6 6 6 6 6 6 6 6 6 6 6 6 1 1 1 1 1 1 1 1 1 1 1 1 1 1 1 1 1 1 1
symmnumber: 1
zpe: 769478.5 jmol-1
zpe.correction: 0.293079 hartree
zpe.thermalcorrener: 0.307448 hartree
zpe.thermalcorrenthalpy: 0.308392 hartree
zpe.thermalcorrgfe: 0.251901 hartree
zpe.sumelectzpe: -635.603081 hartree
zpe.sumelectthermal: -635.588712 hartree
zpe.sumelectthermalent: -635.587768 hartree
zpe.sumelectthermalfe: -635.644259 hartree
dipole: -2.3472 0.7605 1.9844
dipole: 3.1664
quadrupole: -82.5090 -83.1417 -97.9886
quadrupole: -0.2805 -5.2759 6.8052
quadrupole: 5.3708 4.7381 -10.1089 -0.2805 -5.2759 6.8052
hfenergy: -635.8961598 hartree
pointgroup: C01 [X(C13H19N1O1)]
dipole: -0.920384 0.2797293 0.7915271 debye
polarizability: 195.180393|6.4249856|157.2668334|-8.4311574|12.162756|101.8047396 unknown
InChI: InChI=1S/C13H19NO/c1-10-3-5-12-6-4-11(2)14(7-8-15)13(12)9-10/h3,5,9,11,15H,4,6-8H2,1-2H3
charge 0 multiplicity 1
34 atoms
O  -2.818192 2.173571 -1.243047
N  -1.064972 0.225821 0.40986
C  -2.117741 -0.81209 0.239031
C  -1.67478 -1.863484 -0.803585
C  -0.302191 -2.461936 -0.433015
C  0.296686 -0.04325 0.172172
C  0.722034 -1.355951 -0.231316
C  -1.513504 1.560403 0.814886
C  -2.5079 -1.450315 1.597755
C  1.29281 0.970717 0.322412
C  2.09313 -1.592231 -0.451757
C  2.668208 0.711275 0.117252
C  -1.701949 2.551437 -0.358694
C  3.070887 -0.587335 -0.276164
C  3.692565 1.815002 0.333029
H  -3.005319 -0.293088 -0.172081
H  -1.61079 -1.375447 -1.794138
H  -2.444737 -2.655102 -0.865223
H  0.040758 -3.151815 -1.226451
H  -0.401076 -3.074792 0.486856
H  -0.803707 2.000044 1.543953
H  -2.477669 1.458617 1.352516
H  -1.658411 -1.999295 2.039534
H  -2.818157 -0.676816 2.324818
H  -3.352198 -2.15364 1.468692
H  1.007061 1.990302 0.601839
H  2.401423 -2.595707 -0.773901
H  -0.815938 2.542176 -1.01258
H  -1.844665 3.5807 0.039888
H  4.129952 -0.805766 -0.453491
H  4.642752 1.585484 -0.180166
H  3.328923 2.78842 -0.04445
H  3.920903 1.945448 1.40913
H  -3.667693 2.267644 -0.740965
