program: Gaussian 09
title: 000103837
version: EM64L-G09RevD.01
frameworkgroup: C1[X(C8H14N2O3)]
method: RPBEPBE
basis: SDD
operation: Freq
keyword: #p
keyword: freq=noraman
keyword: PBEPBE/SDD
title: #p freq=noraman PBEPBE/SDD
converged: YES YES NO NO
title: Mulliken charges:
elementType: O O O N N C C C C C C C C H H H H H H H H H H H H H H
charge: -0.307272 -0.306337 -0.438393 -0.161794 -0.076558 -0.342428 -0.404465 -0.535290 -0.455486 0.172781 0.307957 -0.208165 -0.675261 0.241751 0.242587 0.272122 0.215831 0.222755 0.253568 0.255467 0.243749 0.227034 0.223339 0.210985 0.226453 0.227517 0.367551
chargesum: 0.00000
title: Mulliken charges with hydrogens summed into heavy atoms:
elementType: O O O N N C C C C C C C C
charge: -0.307272 -0.306337 -0.070842 -0.161794 -0.076558 0.141910 0.083488 -0.058967 0.043730 0.172781 0.307957 0.242208 -0.010305
polarizability: 1.50280459e+02 2.95790895e+00 1.03034582e+02 6.29127586e+00 -2.50779871e+00 8.33683417e+01
1716.lowfreq: -20.3091 -4.1439 -0.0005 -0.0004 -0.0003 3.3331 21.9430 27.1885 87.6653
frequency: 16.6765 27.1303 87.5772 90.3632 112.5113 139.2437 182.2792 206.6464 248.0984 252.6652 290.6689 307.1263 333.5944 353.4813 405.0372 455.8569 465.9850 533.1277 540.1413 588.5271 633.0990 696.8035 752.1051 763.0748 799.2075 833.0508 843.1353 867.4592 955.5015 965.4422 983.4302 1020.8940 1036.0320 1060.5456 1079.3357 1111.1068 1138.8649 1159.0203 1176.7562 1198.2043 1213.8091 1238.1158 1247.4121 1265.2558 1291.1746 1310.3708 1329.6337 1342.7095 1357.5503 1367.0350 1390.1431 1399.7933 1434.8965 1455.8171 1462.2387 1476.4573 1490.7806 1491.7738 1493.9034 1622.8268 1639.7791 2969.8156 2982.8803 2992.1629 2993.6076 2994.2282 3008.4034 3042.7515 3046.0062 3065.8102 3083.3344 3089.9772 3090.8697 3104.7117 3570.2479
redmass: 2.3884 3.9488 3.0012 4.4389 4.1839 2.9475 2.8803 4.5577 1.2131 4.0553 5.1912 3.1170 2.5849 4.0454 1.3633 3.0277 2.1686 4.1851 3.8503 4.8226 2.1321 10.9654 4.1648 4.8256 1.0963 2.0312 2.2674 5.9979 2.3699 2.1646 2.1570 1.8898 2.4084 2.3995 2.7243 2.1967 1.4633 2.0232 1.3842 1.5103 1.2905 1.4750 1.1354 1.9917 1.7488 1.5354 1.3949 1.6126 1.4382 1.4331 1.7710 1.6230 1.0903 1.0870 1.0411 1.0529 1.0776 1.0823 1.0787 7.7383 10.4091 1.0707 1.0684 1.0610 1.0390 1.0557 1.0581 1.0991 1.1033 1.1065 1.0947 1.0939 1.0985 1.1027 1.0675
irintensity: 0.0266 0.2154 6.9715 0.3530 0.9691 2.8430 1.4664 0.3388 1.0288 8.6993 0.3329 10.1216 1.0102 7.5323 97.7974 41.5111 29.5952 12.7366 6.4077 9.6127 1.8714 19.1900 1.0554 18.0491 3.0330 0.0451 14.4129 126.1595 39.5522 24.9915 23.3127 0.4674 89.5639 36.3402 152.5323 1.3007 4.8553 34.9498 22.8796 111.8293 17.5772 80.3256 0.5312 76.9943 78.8289 44.3265 31.1368 19.1190 2.1507 8.5310 150.9525 27.8330 15.0861 20.2033 12.2397 7.9152 10.0017 18.3346 18.8999 17.5064 392.2115 33.6594 31.4203 8.9880 6.7514 40.2724 27.4880 12.6851 34.0420 8.5239 15.4653 3.3494 34.7734 49.6010 42.2461
temp: 298.150 k
press: 1.00000 atm
elementType: 8 8 8 7 7 6 6 6 6 6 6 6 6 1 1 1 1 1 1 1 1 1 1 1 1 1 1
symmnumber: 1
zpe: 580584.1 jmol-1
zpe.correction: 0.221133 hartree
zpe.thermalcorrener: 0.234949 hartree
zpe.thermalcorrenthalpy: 0.235893 hartree
zpe.thermalcorrgfe: 0.178803 hartree
zpe.sumelectzpe: -647.359053 hartree
zpe.sumelectthermal: -647.345237 hartree
zpe.sumelectthermalent: -647.344293 hartree
zpe.sumelectthermalfe: -647.401382 hartree
dipole: -0.4048 -2.0818 0.6321
dipole: 2.2129
quadrupole: -68.3235 -82.8800 -74.1231
quadrupole: -6.4369 0.0222 1.0833
quadrupole: 6.7854 -7.7712 0.9858 -6.4369 0.0222 1.0833
hfenergy: -647.5801854 hartree
pointgroup: C01 [X(C8H14N2O3)]
dipole: -0.1747167 -0.8331493 0.182616 debye
polarizability: 150.0979334|1.7966278|103.2387569|7.6450255|-1.0508254|83.3466925 unknown
InChI: InChI=1S/C8H14N2O3/c1-2-13-8(11)10-5-3-7(9-12)4-6-10/h12H,2-6H2,1H3
charge 0 multiplicity 1
27 atoms
O  2.426308 -0.387248 -0.071912
O  1.999965 1.926873 0.058465
O  -4.24681 0.066431 -1.289322
N  0.307772 0.330564 0.429152
N  -3.509717 -0.933926 -0.484842
C  -0.066133 -1.107382 0.48977
C  -0.73028 1.360165 0.659499
C  -1.551485 -1.259511 0.893076
C  -1.992647 1.056042 -0.171565
C  -2.436972 -0.380416 0.032895
C  1.594451 0.733696 0.137463
C  3.844877 -0.058252 -0.388096
C  4.552238 -1.384419 -0.650939
H  0.580802 -1.632594 1.21592
H  0.109732 -1.576994 -0.496101
H  -0.293389 2.332435 0.38072
H  -0.985094 1.40773 1.737858
H  -1.673853 -0.968503 1.955979
H  -1.859311 -2.314612 0.804336
H  -1.800238 1.223184 -1.249314
H  -2.816311 1.745681 0.095862
H  3.86508 0.612145 -1.266141
H  4.279037 0.488211 0.468921
H  5.615427 -1.199427 -0.890335
H  4.505044 -2.040689 0.23519
H  4.091412 -1.914169 -1.502356
H  -5.015504 -0.464315 -1.621283
