program: Gaussian 09
title: 000103840
version: EM64L-G09RevD.01
frameworkgroup: C1[X(C14H15N3O2)]
method: RPBEPBE
basis: SDD
operation: Freq
keyword: #p
keyword: freq=noraman
keyword: PBEPBE/SDD
title: #p freq=noraman PBEPBE/SDD
converged: NO YES NO NO
title: Mulliken charges:
elementType: O O N N N C C C C C C C C C C C C C C H H H H H H H H H H H H H H H
charge: -0.233257 -0.199122 -0.269691 0.006864 -0.431506 -0.402333 0.233200 0.168255 -0.683302 0.414950 -0.353343 -0.389913 0.107304 -0.222007 -0.205413 -0.249589 0.351811 -0.827706 -0.631440 0.281255 0.269157 0.241186 0.202605 0.343101 0.297224 0.298954 0.224939 0.227048 0.226693 0.229792 0.228713 0.252678 0.228438 0.264454
chargesum: 0.00000
title: Mulliken charges with hydrogens summed into heavy atoms:
elementType: O O N N N C C C C C C C C C C C C C C
charge: -0.233257 -0.199122 -0.269691 0.006864 -0.088405 -0.121078 0.233200 0.168255 0.029645 0.414950 -0.056119 -0.090960 0.107304 0.002932 0.021635 -0.022896 0.351811 -0.116522 -0.138548
polarizability: 2.95812162e+02 -4.54108346e+00 2.09519599e+02 -2.74196154e-02 -5.72125139e+00 8.39320295e+01
1716.lowfreq: -2.8966 -1.1295 -0.0006 -0.0002 0.0001 1.8013 30.2680 39.5068 53.1110
frequency: 30.1395 39.5019 53.1103 59.5427 61.7688 71.7317 120.7572 146.8451 201.1246 211.8917 219.9686 229.4104 239.6340 266.0254 290.0616 334.2647 346.9682 368.8609 379.6948 410.6084 420.5344 435.0137 518.5473 547.2000 580.4619 596.9762 613.5816 617.4398 641.1671 649.0013 679.7143 694.4291 701.6720 768.4893 770.7905 787.8151 829.8266 858.4584 885.7485 910.2531 935.2031 943.2424 985.0605 991.2169 994.5336 998.4759 999.5734 1009.5082 1030.2396 1043.0091 1049.2762 1068.5677 1083.4518 1100.0158 1130.9245 1160.5641 1172.2907 1189.3847 1212.4000 1261.5601 1274.1216 1294.3822 1323.9591 1358.2887 1383.6989 1391.6715 1396.5180 1413.5839 1447.7558 1469.0060 1473.9532 1481.0472 1482.5068 1485.2926 1504.1543 1576.5553 1593.3946 1607.1746 1611.0614 1634.3331 1658.8667 2959.5646 2987.9159 2995.7226 3033.3249 3083.2814 3091.6253 3104.0646 3105.0036 3128.7398 3141.0344 3160.6004 3184.7270 3188.2693 3217.9160 3543.3863
redmass: 3.6115 4.0797 4.1852 5.1901 4.5065 6.2475 4.6648 4.4290 3.2256 3.5314 1.1673 1.2950 2.5295 4.9946 7.5170 4.5431 5.4880 5.0861 3.9894 2.9886 4.1667 4.0514 3.5801 4.3332 4.4046 4.7710 5.7884 1.2418 2.5328 2.4250 5.8684 5.5598 2.1325 2.9301 1.9370 2.1525 3.8667 1.2415 4.1739 4.5328 1.4119 1.9908 6.1598 1.3506 1.3140 1.3829 1.2987 2.7556 2.1017 2.6557 1.5058 1.7381 2.6299 2.0111 2.7309 3.1424 1.0530 1.1767 1.5879 1.5916 2.8234 3.6536 1.3727 3.3159 9.0203 1.1768 1.2288 1.2401 2.3872 1.1545 1.1805 1.0544 1.0473 2.4082 2.0192 5.7187 7.0388 4.6968 5.8300 11.1762 5.5607 1.0394 1.0369 1.0812 1.0983 1.0991 1.0953 1.1013 1.0619 1.0853 1.0909 1.0973 1.0946 1.0962 1.1157 1.0761
irintensity: 2.5957 0.0354 3.5934 0.8610 0.9677 5.1020 0.3816 0.3258 0.9238 1.8077 0.6567 0.9412 0.1061 6.7341 3.2547 1.7530 12.0682 0.7979 3.2339 0.0953 1.9030 4.5084 11.5374 6.7873 4.2418 19.1760 1.6284 54.5555 14.1319 21.0392 12.4703 22.6442 40.5136 18.5746 65.7789 15.4105 2.0458 0.0082 9.6313 34.3139 12.0338 0.2482 1.0553 0.2030 57.6859 9.9433 3.3520 7.6121 38.6897 29.1583 5.1603 2.6742 3.2670 18.5413 219.0825 25.7735 0.0312 15.4126 14.1230 5.5312 40.1875 37.5042 11.5417 94.6638 0.3693 31.4477 5.9905 32.0312 3.8422 108.1048 182.6035 40.8550 21.3656 111.5320 385.5059 40.6542 24.1868 29.8667 97.5821 223.8707 4.6163 21.3629 33.4867 2.4332 21.2775 22.2939 23.9684 12.5574 6.4571 0.1409 23.9495 33.6988 0.8382 9.6641 5.0021 32.8299
temp: 298.150 k
press: 1.00000 atm
elementType: 8 8 7 7 7 6 6 6 6 6 6 6 6 6 6 6 6 6 6 1 1 1 1 1 1 1 1 1 1 1 1 1 1 1
symmnumber: 1
zpe: 698224.6 jmol-1
zpe.correction: 0.265940 hartree
zpe.thermalcorrener: 0.283808 hartree
zpe.thermalcorrenthalpy: 0.284752 hartree
zpe.thermalcorrgfe: 0.218717 hartree
zpe.sumelectzpe: -855.800663 hartree
zpe.sumelectthermal: -855.782795 hartree
zpe.sumelectthermalent: -855.781850 hartree
zpe.sumelectthermalfe: -855.847886 hartree
dipole: 5.8245 2.4755 0.0188
dipole: 6.3288
quadrupole: -85.2500 -113.7049 -114.4785
quadrupole: 14.8895 -1.4587 0.0094
quadrupole: 19.2278 -9.2271 -10.0007 14.8895 -1.4587 0.0094
hfenergy: -856.0666024 hartree
pointgroup: C01 [X(C14H15N3O2)]
dipole: 2.2980979 0.9581928 0.0197443 debye
polarizability: 295.7103985|-5.0833979|209.8398686|-2.9529269|-0.2317499|83.7135238 unknown
InChI: InChI=1S/C14H15N3O2/c1-9(2)13(18)15-12-10(3)14(19)17(16-12)11-7-5-4-6-8-11/h4-8,10,15H,1H2,2-3H3
charge 0 multiplicity 1
34 atoms
O  -1.837615 2.839388 -0.122941
O  2.308289 -1.995521 -0.092966
N  -1.18317 0.532196 -0.070479
N  0.044085 -0.22886 -0.053449
N  2.384012 0.348753 -0.118762
C  0.558755 2.102282 -0.192013
C  1.024383 0.659269 -0.117795
C  -0.974071 1.920521 -0.130115
C  1.071587 3.045717 0.921838
C  -2.407145 -0.203073 -0.004709
C  -3.656807 0.472359 0.002091
C  -2.35528 -1.620389 0.05161
C  2.987393 -0.934651 -0.102769
C  -4.8464 -0.284206 0.065014
C  -3.556628 -2.355357 0.114768
C  -4.80828 -1.69627 0.121819
C  4.501755 -0.904466 -0.102849
C  5.251335 0.418833 -0.104519
C  5.140831 -2.105538 -0.099962
H  0.807414 2.537475 -1.180699
H  0.506145 3.99207 0.872854
H  0.918144 2.602233 1.92052
H  2.14533 3.280835 0.80139
H  3.009446 1.156612 -0.126123
H  -3.687858 1.5631 -0.039308
H  -1.383313 -2.118825 0.044341
H  -5.808897 0.239509 0.069129
H  -3.511437 -3.449195 0.158569
H  -5.737839 -2.273705 0.170685
H  5.018435 1.029919 0.790544
H  5.02738 1.023228 -1.006516
H  6.33963 0.244693 -0.099063
H  6.233717 -2.176605 -0.098855
H  4.560375 -3.03433 -0.09808
