program: Gaussian 09
title: 000103825
version: EM64L-G09RevD.01
frameworkgroup: C1[X(C11H22O)]
method: RPBEPBE
basis: SDD
operation: Freq
keyword: #pfreq=noraman
keyword: PBEPBE/SDD
title: #p freq=noraman PBEPBE/SDD
converged: YES YES NO NO
title: Mulliken charges:
elementType: O C C C C C C C C C C C H H H H H H H H H H H H H H H H H H H H H H
charge: -0.295797 0.391039 -0.459495 -0.379620 -0.409295 -0.124285 -0.754531 -0.747858 -0.729215 -0.035641 -0.531602 -0.611468 0.204350 0.195101 0.213149 0.229974 0.187158 0.192851 0.203315 0.211407 0.216860 0.232244 0.245632 0.222954 0.196416 0.206402 0.228396 0.213961 0.217061 0.230291 0.200374 0.207497 0.212783 0.219594
chargesum: 0.00000
title: Mulliken charges with hydrogens summed into heavy atoms:
elementType: O C C C C C C C C C C C
charge: -0.295797 0.391039 -0.060044 0.063502 -0.029286 0.079030 -0.094021 -0.082857 -0.080455 0.181420 0.106560 -0.179091
polarizability: 1.30098159e+02 3.93896864e+00 1.25543122e+02 2.75018838e+00 4.57769120e+00 1.11608681e+02
1716.lowfreq: -11.1757 -7.2273 0.0006 0.0006 0.0006 10.0184 22.2008 40.3692 55.4296
frequency: 22.0055 40.2451 55.3901 77.1551 96.7783 116.6873 130.5958 183.2382 200.3967 210.4637 218.7602 233.6372 258.9722 275.5451 311.5977 327.0630 328.2268 347.2497 384.3969 439.6546 484.8632 492.7413 535.9764 679.6631 696.8836 740.7074 786.2239 834.1920 841.9857 916.8952 921.8454 926.7732 941.7246 971.7474 981.3467 1003.6463 1010.4035 1017.3605 1026.4795 1058.6225 1074.7971 1093.3973 1112.1232 1128.4292 1149.2422 1176.0532 1198.4026 1208.3205 1237.0493 1256.0935 1271.3773 1285.6829 1290.2889 1301.0459 1311.5727 1332.5945 1355.8336 1370.3520 1380.8211 1387.9684 1427.7027 1431.5909 1446.5380 1458.1380 1461.4103 1465.4392 1471.1020 1471.6057 1476.2310 1477.5588 1479.8536 1488.3230 1490.0838 1654.5645 2934.8824 2946.2081 2961.3127 2969.7247 2973.2962 2979.4525 2982.8371 2992.6271 2999.5252 3006.7268 3011.1333 3049.0857 3054.9780 3064.1703 3073.3925 3078.3095 3083.2975 3086.8810 3088.4166 3090.9906 3102.9724 3190.4603
redmass: 3.1260 3.1282 3.1270 2.2577 2.6730 2.0114 1.7011 1.2502 1.4791 1.1628 1.4787 2.3706 1.2204 2.4159 2.0762 2.2573 2.1215 2.8027 2.4144 2.5884 2.7209 2.7207 2.8918 1.7485 3.1608 1.2057 1.9162 2.2218 1.5853 1.6518 1.6998 1.4752 1.3315 1.3606 1.3808 1.1454 1.4768 5.4533 3.1562 1.6912 2.0800 2.2528 1.2721 1.9377 1.5592 2.1745 2.1042 1.8201 1.8493 1.3983 1.4447 1.2810 1.2574 1.3291 1.3255 1.4691 1.5713 1.2392 1.2104 1.2290 1.1992 1.1264 1.0589 1.0655 1.0686 1.0562 1.0625 1.0475 1.0552 1.0599 1.0636 1.0797 1.0574 4.7785 1.0342 1.0596 1.0590 1.0357 1.0832 1.0362 1.0606 1.0362 1.0970 1.1001 1.1011 1.1030 1.0852 1.0974 1.0986 1.0995 1.1002 1.0689 1.0975 1.0992 1.0993 1.1143
irintensity: 0.1300 0.0235 0.0214 4.4855 0.1281 1.9515 0.0894 0.2091 0.2908 1.9844 0.9502 2.6315 2.1826 1.9148 0.4341 2.1034 3.4455 1.0998 1.2146 6.4557 1.7376 0.5716 0.3428 13.5874 7.0644 8.6507 1.8538 2.3512 2.2866 1.1021 1.0714 2.3590 90.6937 9.8513 0.8957 15.4535 8.5820 43.9191 17.5999 10.8903 1.6940 4.9090 0.1037 7.4447 5.7936 30.5202 8.0646 22.5984 31.8342 7.0270 3.7172 1.6813 8.1001 4.8438 4.6285 5.0814 1.8889 29.5082 12.7105 24.0690 8.0507 3.1462 0.2765 5.1187 1.3545 4.5274 4.0276 10.6706 4.5614 12.3533 4.0412 13.7497 14.1205 14.8784 57.3759 18.6381 30.7618 41.5445 10.7407 21.3835 42.3928 15.4720 34.3527 10.0612 77.3406 44.5938 13.2273 75.7156 45.7366 41.1508 4.2971 5.8359 21.7049 68.7181 30.7404 29.4019
temp: 298.150 k
press: 1.00000 atm
elementType: 8 6 6 6 6 6 6 6 6 6 6 6 1 1 1 1 1 1 1 1 1 1 1 1 1 1 1 1 1 1 1 1 1 1
symmnumber: 1
zpe: 798330.3 jmol-1
zpe.correction: 0.304068 hartree
zpe.thermalcorrener: 0.320213 hartree
zpe.thermalcorrenthalpy: 0.321157 hartree
zpe.thermalcorrgfe: 0.259908 hartree
zpe.sumelectzpe: -506.549408 hartree
zpe.sumelectthermal: -506.533263 hartree
zpe.sumelectthermalent: -506.532319 hartree
zpe.sumelectthermalfe: -506.593567 hartree
dipole: -0.0751 -1.1946 -1.3693
dipole: 1.8187
quadrupole: -80.0549 -74.3211 -77.0918
quadrupole: 2.6851 2.2451 -2.7257
quadrupole: -2.8990 2.8348 0.0641 2.6851 2.2451 -2.7257
hfenergy: -506.8534755 hartree
pointgroup: C01 [X(C11H22O1)]
dipole: 0.0305825 0.5437718 -0.4640731 debye
polarizability: 130.0599212|4.3749985|126.6674616|-1.8107421|-2.3307091|110.5225787 unknown
InChI: InChI=1S/C11H22O/c1-6-10(2)8-7-9-11(3,4)12-5/h6,10H,1,7-9H2,2-5H3
charge 0 multiplicity 1
34 atoms
O  2.594626 0.048771 1.180631
C  2.395576 -0.281874 -0.266419
C  1.104574 0.390115 -0.815915
C  -0.19381 0.02638 -0.06379
C  -1.391467 0.89591 -0.504716
C  -2.741127 0.497769 0.163853
C  3.62603 0.157792 -1.095041
C  2.288204 -1.818571 -0.2437
C  -3.832192 1.559389 -0.139965
C  -3.20322 -0.870819 -0.3053
C  2.785379 1.458815 1.509928
C  -3.415574 -1.954063 0.483207
H  1.005334 0.114267 -1.885872
H  1.240028 1.492035 -0.799642
H  -0.025534 0.144061 1.02538
H  -0.440645 -1.039886 -0.227447
H  -1.509046 0.840552 -1.6086
H  -1.179971 1.960072 -0.268767
H  -2.584608 0.457053 1.261753
H  3.690743 1.25703 -1.192342
H  3.568521 -0.26416 -2.115079
H  4.553671 -0.209405 -0.620621
H  1.511339 -2.140615 0.468821
H  3.247893 -2.257886 0.079834
H  2.037423 -2.209633 -1.2464
H  -4.01445 1.635491 -1.229365
H  -4.789359 1.297908 0.34551
H  -3.520276 2.557644 0.220579
H  -3.382832 -0.954749 -1.391123
H  2.924144 1.485203 2.603337
H  1.904627 2.081385 1.246972
H  3.685296 1.890253 1.025407
H  -3.762395 -2.908945 0.07148
H  -3.248301 -1.915388 1.567212
