program: Gaussian 09
title: 000103826
version: EM64L-G09RevD.01
frameworkgroup: C1[X(C12H22O2)]
method: RPBEPBE
basis: SDD
operation: Freq
keyword: #pfreq=noraman
keyword: PBEPBE/SDD
title: #p freq=noraman PBEPBE/SDD
converged: YES YES NO NO
title: Mulliken charges:
elementType: O O C C C C C C C C C C C C H H H H H H H H H H H H H H H H H H H H H H
charge: -0.292432 -0.264532 0.371729 -0.442522 -0.380785 -0.406398 -0.127561 -0.737584 -0.746431 -0.727600 -0.035510 0.293905 -0.612865 -0.757992 0.198001 0.250537 0.198152 0.225825 0.186439 0.205843 0.202070 0.262818 0.212628 0.220647 0.244034 0.224335 0.204369 0.206613 0.227718 0.217016 0.217278 0.213165 0.218650 0.244870 0.243470 0.242101
chargesum: 0.00000
title: Mulliken charges with hydrogens summed into heavy atoms:
elementType: O O C C C C C C C C C C C C
charge: -0.292432 -0.264532 0.371729 0.006015 0.043193 -0.014116 0.074509 -0.041492 -0.073692 -0.076254 0.181767 0.293905 -0.181050 -0.027551
polarizability: 1.36363737e+02 3.75116611e+00 1.32755455e+02 2.94225479e+00 4.03357345e+00 1.35986563e+02
1716.lowfreq: -13.7228 -1.5780 -0.0011 -0.0007 -0.0005 3.4519 18.6031 32.0078 44.8784
frequency: 15.7692 31.6873 44.8285 58.0388 69.9064 85.6345 102.1234 114.2233 150.8752 177.1035 199.1324 204.6704 216.6727 228.0422 247.9469 301.2256 306.5284 314.9565 333.0391 334.2552 384.7323 432.7456 454.4153 488.0108 530.7062 576.2295 597.6383 680.1371 721.8591 738.3066 787.8600 832.5377 843.6709 898.1722 922.8162 927.4739 934.2183 940.0238 974.4385 991.3702 997.4106 1004.7343 1016.1735 1027.8382 1039.1450 1062.9458 1079.5024 1092.6491 1131.2287 1161.8524 1197.2748 1202.2204 1228.2892 1243.8296 1258.2329 1275.5411 1286.2837 1292.9256 1308.9812 1314.8312 1337.1083 1363.6529 1374.7454 1378.9973 1385.0691 1392.1376 1426.6480 1449.0121 1452.1498 1455.1628 1459.1925 1464.6916 1469.6844 1472.1267 1472.9872 1477.7703 1482.3737 1493.0660 1636.1657 1653.8969 2950.2785 2971.2421 2972.7503 2974.3256 2982.1880 2989.3858 2994.7187 3005.6388 3005.9935 3035.5344 3054.5162 3060.3633 3065.6083 3079.8318 3081.0532 3086.2001 3092.4678 3094.3635 3102.9208 3111.4812 3140.0547 3189.8718
redmass: 3.4110 3.7955 1.2597 2.8089 3.6066 2.3941 2.3390 2.3993 2.7509 2.5374 1.1145 1.8683 1.4072 2.0891 1.2443 2.8324 2.0956 2.7800 2.4142 2.1893 3.1660 2.5775 2.5941 2.7730 2.8137 3.1637 3.7111 1.6509 4.9121 1.2019 2.0350 2.5439 1.5227 3.6722 1.6274 1.8996 1.5642 1.3370 1.3206 1.4769 1.8018 1.1452 1.4223 2.8428 1.6666 1.9379 1.9252 2.2461 1.9912 2.2052 2.5583 1.9455 2.6305 1.9612 1.3725 1.3980 1.3139 1.2606 1.2982 1.3664 1.4543 1.5151 1.2261 1.2442 1.2095 1.2317 1.1990 1.0595 1.0713 1.0477 1.0787 1.0706 1.0582 1.0488 1.0481 1.0615 1.0934 1.0544 8.3440 4.7973 1.0610 1.0362 1.0712 1.0728 1.0612 1.0365 1.0366 1.0364 1.0977 1.0991 1.0844 1.1002 1.0979 1.0996 1.0991 1.0689 1.0992 1.0974 1.0998 1.0997 1.1011 1.1143
irintensity: 0.2459 0.1303 2.8739 0.0224 1.2668 0.6428 1.6302 0.0531 1.2427 3.7166 0.5407 1.3127 0.6973 0.1916 0.2685 3.2089 0.4343 1.7992 4.2800 0.0385 2.5133 3.4371 4.4902 0.2089 0.5880 5.4718 1.6044 14.0576 9.8883 9.3725 1.1933 1.3544 0.8992 34.9038 4.1575 16.4955 3.8911 88.3145 4.3916 7.8705 72.4056 14.8253 2.5813 0.3406 10.0471 8.9833 6.8643 15.0114 11.8009 151.8501 102.0708 40.0362 88.5151 30.0862 6.5433 1.8252 2.4788 5.9859 0.5910 3.9200 7.0103 5.9883 32.5855 59.5919 11.0547 20.2166 7.9458 2.4248 35.1152 16.9575 0.0556 8.4194 5.1777 3.4745 10.8761 7.8882 10.0087 27.0203 154.9489 15.8327 17.7942 35.6218 11.0034 3.3814 53.9524 22.4022 25.9177 3.9769 9.6044 20.4032 12.2939 24.6392 79.6203 40.6348 13.3768 5.7304 47.0767 10.9061 26.2107 13.6627 11.4564 29.7137
temp: 298.150 k
press: 1.00000 atm
elementType: 8 8 6 6 6 6 6 6 6 6 6 6 6 6 1 1 1 1 1 1 1 1 1 1 1 1 1 1 1 1 1 1 1 1 1 1
symmnumber: 1
zpe: 822751.7 jmol-1
zpe.correction: 0.313370 hartree
zpe.thermalcorrener: 0.331586 hartree
zpe.thermalcorrenthalpy: 0.332530 hartree
zpe.thermalcorrgfe: 0.265377 hartree
zpe.sumelectzpe: -619.774588 hartree
zpe.sumelectthermal: -619.756372 hartree
zpe.sumelectthermalent: -619.755428 hartree
zpe.sumelectthermalfe: -619.822581 hartree
dipole: 0.2586 1.3040 0.9503
dipole: 1.6342
quadrupole: -89.5949 -85.3668 -87.6674
quadrupole: -2.0959 -5.6231 -6.6837
quadrupole: -2.0518 2.1762 -0.1244 -2.0959 -5.6231 -6.6837
hfenergy: -620.0879578 hartree
pointgroup: C01 [X(C12H22O2)]
dipole: -0.1037712 -0.5376208 0.3369851 debye
polarizability: 136.3997634|4.0410648|133.3690035|-2.6341732|-4.1590578|135.3369886 unknown
InChI: InChI=1S/C12H22O2/c1-6-10(2)8-7-9-12(4,5)14-11(3)13/h6,10H,1,7-9H2,2-5H3
charge 0 multiplicity 1
36 atoms
O  2.24103 -0.038509 0.780121
O  2.543964 1.753213 -0.709448
C  1.853386 -1.059748 -0.293304
C  0.585198 -0.58657 -1.051536
C  -0.644112 -0.274458 -0.169972
C  -1.80238 0.328943 -0.994439
C  -3.084732 0.62437 -0.161883
C  3.046724 -1.250143 -1.251126
C  1.607884 -2.32418 0.547912
C  -4.110817 1.419011 -1.013889
C  -3.718043 -0.657491 0.350515
C  2.553182 1.277595 0.451217
C  -3.930026 -0.978215 1.651528
C  2.906294 2.048816 1.710206
H  0.32497 -1.390906 -1.770613
H  0.849574 0.305136 -1.648261
H  -0.355974 0.438591 0.628471
H  -0.999949 -1.18981 0.340345
H  -2.065259 -0.358214 -1.827429
H  -1.459958 1.272764 -1.466426
H  -2.795551 1.24569 0.711144
H  3.225079 -0.343279 -1.85042
H  2.836465 -2.091957 -1.936256
H  3.96258 -1.491784 -0.682937
H  0.856203 -2.139903 1.332706
H  2.542475 -2.649037 1.036884
H  1.246454 -3.142544 -0.100647
H  -4.427808 0.830473 -1.896431
H  -5.014441 1.661714 -0.426791
H  -3.668425 2.364403 -1.379973
H  -4.034197 -1.366389 -0.43424
H  -4.40874 -1.92013 1.943448
H  -3.632754 -0.303128 2.464208
H  3.76616 1.576836 2.216367
H  2.05975 2.030198 2.418555
H  3.151892 3.088543 1.449796
