program: Gaussian 09
title: 000103820
version: EM64L-G09RevD.01
frameworkgroup: C1[X(C11H13NO2)]
method: RPBEPBE
basis: SDD
operation: Freq
keyword: #p
keyword: freq=noraman
keyword: PBEPBE/SDD
title: #p freq=noraman PBEPBE/SDD
converged: YES YES NO NO
title: Mulliken charges:
elementType: O O N C C C C C C C C C C C H H H H H H H H H H H H H
charge: -0.262552 -0.439407 -0.131557 -0.276706 -0.287917 0.555678 -0.319467 0.243207 -0.447849 -0.375389 -0.744742 -0.219982 -0.231355 -0.238392 0.226859 0.279970 0.186687 0.217697 0.232141 0.243839 0.244825 0.244413 0.251451 0.230071 0.228681 0.357435 0.232361
chargesum: 0.00000
title: Mulliken charges with hydrogens summed into heavy atoms:
elementType: O O N C C C C C C C C C C C
charge: -0.262552 -0.081972 -0.131557 -0.049847 -0.007947 0.555678 0.084918 0.243207 -0.215708 -0.131550 -0.004053 0.010089 -0.002674 -0.006031
polarizability: 1.62691970e+02 8.81546334e+00 1.10927509e+02 2.07377661e+00 1.18632968e+01 1.06535259e+02
1716.lowfreq: -15.0252 -7.1530 -0.0002 0.0004 0.0006 4.6454 21.6303 36.7810 75.3828
frequency: 20.2562 36.6433 75.3246 95.0425 112.4589 138.3997 180.0466 218.1849 253.9777 288.9778 344.4185 373.0699 400.8987 467.7723 525.6816 543.2235 590.7693 609.1613 614.4610 656.0574 694.8927 703.4683 765.1565 827.6660 843.8803 850.8520 861.9007 884.9137 924.6519 975.7873 982.2368 990.2782 997.1572 1003.9762 1005.5540 1027.9831 1048.7042 1065.5242 1079.1848 1093.8943 1173.8163 1180.8311 1188.1885 1200.2029 1219.6085 1244.3687 1274.6190 1300.3580 1310.6575 1328.9489 1353.5803 1386.0618 1390.8341 1396.4745 1445.3111 1454.6610 1459.8555 1470.1310 1485.7541 1596.1280 1615.7826 1639.4613 2937.2143 3004.5103 3016.8360 3029.7465 3064.8919 3086.9986 3118.3684 3123.4281 3136.3721 3138.3560 3148.5203 3165.7379 3496.0379
redmass: 4.0070 4.5484 4.7892 1.5644 2.3347 2.2432 3.7234 4.5345 4.1811 4.0871 4.1912 3.5981 2.7932 3.4301 1.1914 2.9801 4.0284 5.3902 6.3015 3.9535 3.8780 1.9558 1.9745 4.5039 2.9113 1.2673 4.7128 5.8572 1.5372 1.3944 3.0285 5.9434 1.3870 3.1446 2.7415 2.1153 1.6272 1.9254 2.1610 2.0844 1.0551 1.1662 1.1252 1.7056 2.1022 1.8083 1.2524 1.4465 1.5271 1.2051 1.5414 1.2498 4.5088 1.3120 2.1189 1.0448 1.0691 1.0882 2.3696 6.0311 6.1014 8.4756 1.0688 1.0375 1.0867 1.0848 1.0954 1.0974 1.0877 1.0868 1.0910 1.0997 1.0960 1.1015 1.0650
irintensity: 0.6619 0.2430 2.6428 0.2661 3.7849 2.6880 3.6822 1.6577 1.7695 4.3311 8.6595 2.4157 0.3315 3.9584 150.7739 15.5369 10.4290 13.1868 0.8428 11.1644 28.7678 30.3963 62.0153 9.6933 12.3691 0.6571 11.9778 143.1344 3.3789 0.0812 67.6423 0.8065 1.0452 0.7851 47.1219 4.0626 2.9410 11.7246 6.7902 12.0602 0.0878 49.5520 5.0841 97.3073 3.5033 39.1494 7.2741 20.5527 9.0505 22.0771 2.9096 68.5890 4.0899 33.8179 10.3143 18.2794 23.5925 2.4176 9.2034 0.8843 1.5369 127.7178 58.0468 8.8266 17.7242 22.4156 34.2933 8.9639 7.6503 3.4524 9.7160 8.2662 34.7766 21.5200 14.8078
temp: 298.150 k
press: 1.00000 atm
elementType: 8 8 7 6 6 6 6 6 6 6 6 6 6 6 1 1 1 1 1 1 1 1 1 1 1 1 1
symmnumber: 1
zpe: 572742.9 jmol-1
zpe.correction: 0.218146 hartree
zpe.thermalcorrener: 0.231222 hartree
zpe.thermalcorrenthalpy: 0.232166 hartree
zpe.thermalcorrgfe: 0.176656 hartree
zpe.sumelectzpe: -631.115778 hartree
zpe.sumelectthermal: -631.102703 hartree
zpe.sumelectthermalent: -631.101759 hartree
zpe.sumelectthermalfe: -631.157269 hartree
dipole: -2.0568 1.9663 -1.0076
dipole: 3.0186
quadrupole: -78.9570 -87.7429 -80.2130
quadrupole: 12.3971 -4.5424 8.2207
quadrupole: 3.3473 -5.4386 2.0913 12.3971 -4.5424 8.2207
hfenergy: -631.3339248 hartree
pointgroup: C01 [X(C11H13N1O2)]
dipole: 0.7497075 -0.7930455 -0.468462 debye
polarizability: 163.4711622|5.4548382|111.6494379|-3.6047401|-11.4622297|105.0341378 unknown
InChI: InChI=1S/C11H13NO2/c1-8-12-10(7-13)11(14-8)9-5-3-2-4-6-9/h2-6,10-11,13H,7H2,1H3
charge 0 multiplicity 1
27 atoms
O  -0.982766 -1.135016 -0.985632
O  -2.904189 2.60705 0.929058
N  -2.357034 -0.154154 0.614307
C  -0.338074 0.220166 -0.73457
C  -1.270588 0.854465 0.359774
C  1.11044 0.035765 -0.342579
C  -1.93764 2.175507 -0.075928
C  -2.126318 -1.184168 -0.153635
C  2.14127 0.59105 -1.138172
C  1.455274 -0.684695 0.83036
C  -2.931773 -2.440341 -0.261829
C  3.496794 0.438943 -0.767559
C  2.807531 -0.84589 1.197042
C  3.833036 -0.281331 0.40063
H  -0.412325 0.762586 -1.695679
H  -0.728599 1.027681 1.306887
H  -2.424228 2.030427 -1.066446
H  -1.19461 2.988136 -0.154732
H  1.883905 1.141967 -2.051555
H  0.666123 -1.128554 1.449233
H  -2.306993 -3.318452 -0.021238
H  -3.301079 -2.574155 -1.293743
H  -3.784671 -2.395317 0.4305
H  4.286063 0.875665 -1.389286
H  3.065156 -1.408511 2.101233
H  -3.418645 1.794424 1.185886
H  4.88314 -0.404146 0.688074
