program: Gaussian 09
title: 000103819
version: EM64L-G09RevD.01
frameworkgroup: C1[X(C7H9Cl2N3O2)]
method: RPBEPBE
basis: SDD
operation: Freq
keyword: #p
keyword: freq=noraman
keyword: PBEPBE/SDD
title: #p freq=noraman PBEPBE/SDD
converged: YES YES NO NO
title: Mulliken charges:
elementType: Cl Cl O O N N N C C C C C C C H H H H H H H H H
charge: -0.011392 -0.011160 -0.194768 -0.230397 -0.210241 -0.079899 0.047991 -0.382943 -0.334426 0.242325 0.322118 -0.561863 -0.348211 -0.762276 0.244911 0.304567 0.343663 0.277363 0.273600 0.295530 0.244469 0.246574 0.284465
chargesum: 0.00000
title: Mulliken charges with hydrogens summed into heavy atoms:
elementType: Cl Cl O O N N N C C C C C C C
charge: -0.011392 -0.011160 -0.194768 -0.230397 -0.210241 -0.079899 0.047991 0.166534 0.009237 0.242325 0.322118 -0.010901 -0.052681 0.013232
polarizability: 1.40345650e+02 -4.25509047e+00 1.40062189e+02 -1.96551388e+01 -3.10988370e+00 9.49844171e+01
1716.lowfreq: -0.0022 -0.0019 -0.0013 2.6645 3.2885 9.8000 29.9176 46.4551 62.9509
frequency: 29.9094 46.4287 62.9275 71.6579 101.1230 129.2390 154.1144 166.8937 195.2404 220.1416 261.9308 291.9454 318.8077 363.5376 374.4847 406.9204 439.1611 543.2422 591.4630 625.7212 661.3173 681.4145 692.7450 705.0178 753.7187 768.0018 872.7045 873.6519 921.7190 937.4153 977.3332 1043.6744 1048.7940 1100.7664 1127.0821 1153.7747 1168.0699 1204.3666 1222.3753 1257.9577 1277.7920 1304.1918 1319.7110 1335.9254 1351.2454 1357.6604 1399.6446 1401.6551 1434.9070 1448.0282 1463.3339 1470.8299 1476.5751 1489.2836 2988.7683 3041.4990 3053.9997 3064.4822 3107.6401 3124.0575 3126.6930 3130.6082 3253.9584
redmass: 10.8169 10.4293 7.9114 9.1071 4.5235 5.8918 1.0738 5.2434 4.7431 9.5832 10.7260 4.2795 2.5467 3.3266 3.5932 4.8814 5.9970 4.4793 4.7731 4.9859 4.8771 5.4712 7.4618 4.3542 9.7972 4.9235 2.2914 1.4398 1.6214 3.5750 1.7697 1.6930 2.7362 1.9913 3.1637 1.2621 2.6003 2.4970 2.2155 1.1953 1.5125 4.5075 1.6053 6.1016 1.4755 1.7664 1.3425 2.4183 1.1034 1.1474 3.0761 1.0535 2.0150 2.7536 1.0395 1.0570 1.0603 1.0975 1.0904 1.1047 1.0982 1.1034 1.0997
irintensity: 0.5602 0.8506 1.4905 1.2333 0.4949 2.4003 0.4138 3.6063 0.5356 3.5940 6.2344 4.7724 1.0852 6.6446 0.6239 8.6930 11.4364 5.2857 1.1157 27.4201 4.5135 11.5638 3.9537 17.2822 11.1575 5.8795 11.2793 20.5179 20.7831 1.8789 4.8339 2.4312 6.6835 0.9836 23.3347 1.4264 171.0529 15.9603 74.5408 14.2210 8.3589 51.0182 16.7109 286.2389 8.5663 1.4806 9.2908 75.7058 5.3945 22.6172 98.0703 17.7482 65.7638 15.4457 11.0326 16.7682 7.9562 11.9278 1.4931 0.4792 2.2018 4.6023 3.8098
temp: 298.150 k
press: 1.00000 atm
elementType: 17 17 8 8 7 7 7 6 6 6 6 6 6 6 1 1 1 1 1 1 1 1 1
symmnumber: 1
zpe: 430591.5 jmol-1
zpe.correction: 0.164004 hartree
zpe.thermalcorrener: 0.178193 hartree
zpe.thermalcorrenthalpy: 0.179137 hartree
zpe.thermalcorrgfe: 0.120702 hartree
zpe.sumelectzpe: -1505.816148 hartree
zpe.sumelectthermal: -1505.801959 hartree
zpe.sumelectthermalent: -1505.801015 hartree
zpe.sumelectthermalfe: -1505.859449 hartree
dipole: -0.1028 4.9827 -1.8508
dipole: 5.3163
quadrupole: -111.9713 -102.5080 -96.3976
quadrupole: 0.2904 1.2016 -4.2530
quadrupole: -8.3456 1.1176 7.2280 0.2904 1.2016 -4.2530
hfenergy: -1505.9801514 hartree
pointgroup: C01 [X(C7H9Cl2N3O2)]
dipole: 0.383666 1.7930831 -1.006214 debye
dipolederiv: -0.410997 0.1792218 0.1447866 0.1219879 -0.2392041 -0.1083624 0.1275706 -0.1344051 -0.2927487 -0.3105992 0.0240449 -0.1685904 0.0725827 -0.1550524 0.082801 -0.2382068 0.0453373 -0.3463041 -0.7435233 -0.2984709 0.2491678 -0.1859789 -0.5640346 0.0965255 0.3040149 0.1804967 -0.36528 -0.6357623 0.2412286 0.1605276 0.1286177 -0.7455149 -0.0615754 0.1753924 -0.1224328 -0.3170512 -0.5853359 0.3975247 0.1769136 0.3903594 -0.2909933 -0.114603 0.1588726 -0.130437 -0.1765158 -0.6681452 -0.3950678 0.1857814 -0.0602893 -0.5002321 0.0495023 0.2620132 0.2555105 -0.3722985 1.1029711 0.1531191 -0.4272958 0.1787865 1.8070745 -0.1234948 -0.5079807 -0.1294219 0.4568256 0.4972591 -0.1626395 -0.0953451 -0.1911645 0.1821827 -0.0591559 -0.0712074 -0.014287 0.1096886 0.3989318 -0.2164871 -0.2466795 -0.1608055 0.2400446 0.2485611 -0.2131141 0.2176371 0.2931716 0.5155428 0.3176331 -0.2640269 -0.3349254 0.3789338 0.0449758 -0.3120985 -0.254123 0.1964536 0.2906992 -0.0208764 -0.0703099 -0.1516331 -1.0941863 0.1355728 -0.1197481 0.0395729 0.07438 0.2791163 -0.0099667 0.2893975 -0.0726463 0.1105657 -0.1936693 0.2907524 -0.1678134 0.3906699 0.0251026 -0.0447007 -0.0841523 0.2221465 0.5987846 -0.0963697 -0.0691887 -0.0114852 -0.0158923 -0.0531979 -0.1589644 0.0892876 -0.023939 -0.0809989 0.0452228 0.098458 0.113767 0.0112517 0.0165118 -0.0178688 0.0588384 -0.0335132 0.0089651 0.09548 0.0232021 0.0461595 0.0633338 0.0049057 -0.0089342 -0.0501824 0.0387128 0.0474944 -0.0596405 -0.0480756 -0.0115219 0.0612246 0.0875747 -0.0179091 0.0590123 0.0270931 0.0220842 -0.0091804 0.0624893 -0.0151385 0.0097325 -0.0251319 0.0786786 -0.00877 0.0894772 0.0118666 -0.033202 0.0511393 -0.0237229 -0.0028195 0.0362148 -0.0321466 -0.030234 -0.0313868 0.0044141 0.0752566 -0.0126013 0.117228 -0.0253008 0.1005824 -0.0322229 0.0502058 -0.0136936 0.111736 0.0126188 0.0506144 0.0222242 0.1491426 -0.1018904 -0.0323924 -0.0519245 -0.0010264 0.0840022 0.0354906 -0.0707914 0.0192277 0.0587198 0.0881453 -0.040809 0.0225972 -0.0394478 0.0623094 -0.0539607 0.0368596 0.0097554 -0.0838997 0.0910256 0.0980054 0.0109952 0.030686 -0.0002413 -0.0087929 0.0216336 -0.0521276 0.1235163 unknown
polarizability: 138.8500277|-6.8277558|141.1161152|-18.730889|-5.9329966|95.426113 unknown
InChI: InChI=1S/C7H9Cl2N3O2/c1-5-10-3-7(12(13)14)11(5)4-6(9)2-8/h3,6H,2,4H2,1H3
charge 0 multiplicity 1
23 atoms
Cl 3.155097 -1.529175 -1.240288
Cl 3.490772 -0.497334 2.085876
O  -2.796201 -1.8400 0.95696
O  -0.839738 -2.333797 -0.132502
N  -0.373128 0.486963 -0.490754
N  -1.715934 2.180713 0.241786
N  -1.714217 -1.489736 0.342498
C  0.768986 -0.187223 -1.152364
C  1.80883 -0.760163 -0.154697
C  -0.568839 1.86936 -0.428135
C  -1.476358 -0.088243 0.181282
C  2.422097 0.288943 0.762918
C  -2.281067 0.974983 0.619993
C  0.342092 2.886072 -1.041013
H  1.255655 0.550247 -1.811764
H  0.396817 -1.020173 -1.766671
H  1.383756 -1.607044 0.403052
H  1.634148 0.831545 1.310997
H  3.073516 0.988727 0.217954
H  -3.213257 0.911273 1.174399
H  1.366851 2.845308 -0.628544
H  0.416007 2.773277 -2.138662
H  -0.076283 3.880576 -0.826119
