program: Gaussian 09
title: 000103815
version: EM64L-G09RevD.01
frameworkgroup: C1[X(C6H13NS)]
method: RPBEPBE
basis: SDD
operation: Freq
keyword: #p
keyword: freq=noraman
keyword: PBEPBE/SDD
title: #p freq=noraman PBEPBE/SDD
converged: NO YES NO NO
title: Mulliken charges:
elementType: S N C C C C C C H H H H H H H H H H H H H
charge: 0.140658 -0.254098 -0.387509 -0.360279 -0.407731 -0.385864 -0.646984 -0.671611 0.246337 0.245956 0.217314 0.234060 0.219670 0.218928 0.257749 0.210436 0.209467 0.242227 0.210917 0.226913 0.233444
chargesum: 0.00000
title: Mulliken charges with hydrogens summed into heavy atoms:
elementType: S N C C C C C C
charge: 0.140658 0.003651 -0.141172 -0.114324 0.043643 0.052734 0.015146 -0.000337
polarizability: 1.05824787e+02 -1.40466592e+00 8.07631023e+01 -2.16763612e+00 3.69962341e+00 7.24675451e+01
1716.lowfreq: -17.6052 -8.2843 -0.0022 -0.0006 0.0017 18.2191 99.9390 145.2170 203.9758
frequency: 99.6211 145.1699 203.9629 218.9048 251.2673 281.1610 289.6490 340.4714 364.5855 408.3694 470.0709 553.8546 572.5603 586.0457 658.8852 847.5865 875.0045 893.1950 916.7403 974.6090 996.1996 1026.2390 1075.3706 1083.9414 1099.9150 1128.0129 1157.5794 1196.1412 1220.4885 1254.6086 1286.7202 1295.0201 1325.8085 1342.7107 1354.6118 1386.0779 1387.6402 1430.7597 1437.9178 1455.4350 1464.8899 1465.9643 1476.6006 1478.0531 2965.0594 2970.5217 2975.3293 2976.8953 2999.3432 3020.4422 3033.0232 3043.5212 3061.2164 3069.8863 3085.5336 3094.6005 3460.6460
redmass: 3.4719 2.3192 1.0420 1.0744 2.7123 2.7398 3.2674 2.7685 3.0259 2.2841 3.1713 1.7358 4.4712 2.0502 3.1884 2.6112 1.7975 1.6718 2.0446 1.5319 1.7150 1.4365 1.6612 2.3071 1.8594 2.2518 4.2408 1.2951 1.4315 1.2623 1.3687 1.2903 1.2521 1.2747 1.2340 1.2228 1.2053 1.0740 1.1018 1.1917 1.0462 1.0482 1.0472 1.0498 1.0589 1.0412 1.0532 1.0409 1.0867 1.0857 1.1026 1.1024 1.0962 1.0985 1.1000 1.0984 1.0746
irintensity: 2.1291 0.2326 0.2431 0.5329 0.4347 3.9113 5.7245 3.8733 2.3861 8.8239 11.3619 68.9760 29.6959 85.1631 10.4884 6.0083 15.1691 3.6384 7.0826 4.7447 22.2505 8.5931 5.0767 2.3748 1.0300 8.0584 19.7570 6.4540 2.3638 13.9964 3.5093 9.7609 2.5988 0.6144 1.6895 18.6205 18.8617 6.9171 9.3355 13.7652 12.1494 13.8640 10.5070 6.9973 47.1536 30.4759 83.7008 18.8268 11.3136 20.6017 28.5488 29.4872 45.8071 32.5048 31.1287 23.0243 0.9147
temp: 298.150 k
press: 1.00000 atm
elementType: 16 7 6 6 6 6 6 6 1 1 1 1 1 1 1 1 1 1 1 1 1
symmnumber: 1
zpe: 481702.9 jmol-1
zpe.correction: 0.183471 hartree
zpe.thermalcorrener: 0.192684 hartree
zpe.thermalcorrenthalpy: 0.193628 hartree
zpe.thermalcorrgfe: 0.150024 hartree
zpe.sumelectzpe: -688.573472 hartree
zpe.sumelectthermal: -688.564259 hartree
zpe.sumelectthermalent: -688.563315 hartree
zpe.sumelectthermalfe: -688.606920 hartree
dipole: 0.4474 0.5781 1.4547
dipole: 1.6280
quadrupole: -52.3206 -65.1997 -56.8354
quadrupole: -2.1295 -1.0421 1.1866
quadrupole: 5.7979 -7.0811 1.2832 -2.1295 -1.0421 1.1866
hfenergy: -688.7569434 hartree
pointgroup: C01 [X(C6H13N1S1)]
dipole: -0.1588424 -0.1687873 0.5971062 debye
dipolederiv: -0.3834743 0.043765 0.0022443 0.0307845 -0.2534547 -0.049992 -0.0250198 -0.059636 -0.1944115 -0.497013 -0.0405018 -0.0720629 -0.0876857 -0.8612015 0.051764 -0.0950729 -0.0277122 -0.1600525 0.4261966 0.0937996 -0.1107204 0.1276706 -0.0294741 0.0328315 -0.1162048 0.0460012 0.1175489 0.1806626 -0.1853465 0.1237959 -0.252995 0.0925825 -0.0270757 0.181903 -0.0828199 0.2081142 0.1658978 -0.149591 0.1046086 -0.0176486 0.3945503 -0.025049 0.2192518 -0.0590831 0.2450294 0.3565536 0.115476 -0.0524508 0.0601568 0.3169879 0.0020839 -0.1299596 0.1012242 0.1483292 -0.0439714 0.0154187 0.086643 -0.0421546 -0.0366771 -0.0505045 0.0303586 -0.0500988 -0.071193 -0.0847416 -0.0471495 0.030971 0.022348 0.0044138 0.0073897 -0.0832347 0.0096024 0.0610877 -0.0738874 0.0541866 -0.0756853 0.0453093 0.0156764 0.0586586 -0.0651124 0.0482399 -0.0636146 -0.0084011 0.0323567 0.0490004 0.0373244 -0.0062795 0.0205784 0.003714 -0.0041676 -0.17792 -0.1847476 -0.0787356 -0.0043264 -0.1131269 -0.0130408 0.0206768 0.0554886 0.0418904 0.0891747 0.075429 0.0500919 0.0806694 0.0546509 0.0211426 -0.029343 -0.00432 -0.0475587 -0.1438485 0.0294963 -0.0123919 0.0391965 -0.0360407 0.05919 -0.0129779 0.1046039 -0.0751143 -0.1152288 -0.0484483 0.0737587 -0.0791408 0.1033966 -0.0652376 0.0852837 -0.1222905 0.10432 0.0060319 0.0617767 0.0279178 0.0048423 0.0662765 0.3747841 -0.1292796 0.0315958 0.017727 -0.0346794 -0.1840757 -0.0657307 0.0679708 -0.1079427 0.073095 0.0095378 0.0786826 -0.0011323 0.0535703 0.0213613 0.0448838 -0.1343406 0.0475902 0.0647836 0.0960173 -0.0714868 0.051445 -0.0436752 0.1054866 -0.0068209 0.0114296 0.040366 -0.1342627 -0.0491284 -0.0012671 -0.0119758 0.0823047 -0.0690402 0.0669851 -0.0724725 0.118869 0.0225191 0.097914 -0.1004749 0.0837147 0.0151467 0.082654 0.0028526 0.0065856 0.009864 0.0851052 -0.0585286 0.1004746 -0.0465682 -0.1116892 0.0722862 -0.0352246 -0.0067577 -0.1070126 -0.1252025 -0.050857 0.0083706 -0.0382978 0.089975 unknown
polarizability: 105.9494034|-0.9382147|79.8779911|1.5414063|-4.4271585|73.2280395 unknown
InChI: InChI=1S/C6H13NS/c1-5-3-7-4-6(2)8-5/h5-7H,3-4H2,1-2H3
charge 0 multiplicity 1
21 atoms
S  0.26426 1.376984 -0.746121
N  -0.443058 -1.63163 0.253642
C  -1.467962 0.629331 -0.405687
C  1.317525 0.226326 0.365998
C  -1.408827 -0.911773 -0.599276
C  0.971744 -1.253064 0.064942
C  -2.013556 1.062765 0.966094
C  2.793419 0.555786 0.095683
H  -2.083495 1.069812 -1.212824
H  1.05638 0.470621 1.413459
H  -2.416102 -1.33339 -0.40885
H  -1.152067 -1.122401 -1.654696
H  1.249762 -1.467956 -0.9860
H  1.594435 -1.904261 0.711553
H  -0.720711 -1.653544 1.242769
H  -3.045456 0.684281 1.109158
H  -1.391977 0.672245 1.792995
H  -2.031839 2.161959 1.053722
H  3.445805 -0.063806 0.740587
H  3.055058 0.349871 -0.958396
H  3.015461 1.617545 0.303447
