program: Gaussian 09
title: 000104006
version: EM64L-G09RevD.01
frameworkgroup: C1[X(C23H23N7O5)]
method: RPBEPBE
basis: SDD
operation: Freq
keyword: #p
keyword: freq=noraman
keyword: PBEPBE/SDD
title: #p freq=noraman PBEPBE/SDD
converged: YES YES NO NO
title: Mulliken charges:
elementType: O O O O O N N N N N N N C C C C C C C C C C C C C C C C C C C C C C C H H H H H H H H H H H H H H H H H H H H H H H
charge: -0.226374 -0.191021 -0.256387 -0.214742 -0.210497 -0.181623 -0.140581 -0.431568 -0.130812 -0.103328 0.015719 -0.023001 -0.359112 -0.483286 -0.518069 -0.509925 0.201262 0.190152 -0.393160 0.523940 -0.485122 -0.659090 -0.366281 0.324535 -0.281985 -0.051503 0.218490 -0.775992 0.001653 0.327268 -0.257327 -0.505686 0.410223 -0.355330 -0.214130 0.244298 0.283291 0.286949 0.261585 0.268055 0.266090 0.268434 0.270864 0.248183 0.230329 0.319375 0.228209 0.240903 0.226833 0.243671 0.293170 0.337080 0.219726 0.261821 0.259718 0.256297 0.310546 0.287263
chargesum: 0.00000
title: Mulliken charges with hydrogens summed into heavy atoms:
elementType: O O O O O N N N N N N N C C C C C C C C C C C C C C C C C C C C C C C
charge: -0.226374 -0.191021 -0.256387 -0.214742 -0.210497 -0.181623 -0.140581 -0.094488 -0.130812 -0.103328 0.015719 -0.023001 0.168477 0.065248 0.016076 0.029372 0.201262 0.190152 0.085353 0.523940 -0.165747 0.036855 -0.122610 0.324535 0.011185 -0.051503 0.218490 -0.034727 0.001653 0.327268 -0.001030 -0.195140 0.410223 -0.068067 -0.214130
polarizability: 8.99867695e+02 -7.29258790e+01 3.91102658e+02 -4.00824903e+01 -6.59356221e+00 1.58309750e+02
1716.lowfreq: -8.4978 -1.9393 -0.0006 -0.0003 0.0011 2.3581 5.7686 9.4693 13.2659
frequency: -7.7905 9.1468 13.1779 25.5018 32.6131 34.4246 38.9518 55.8270 61.0094 66.1795 72.8052 75.8934 85.9685 88.4216 91.8521 109.0573 114.4902 119.0104 129.6156 140.1895 148.2274 159.5540 185.2037 215.4150 225.8811 241.0765 257.8918 263.6468 267.3157 275.4571 309.3736 316.7291 331.6388 352.9212 364.1515 375.9104 391.6197 393.0575 426.5348 442.4324 448.2233 474.5742 498.8518 512.5023 516.4206 522.5209 540.2224 543.9309 546.6245 573.0790 573.9487 582.7389 586.2508 606.8346 629.1848 638.2201 650.7633 654.1609 654.6060 698.3124 701.6141 732.6436 743.1251 749.7058 774.6917 786.7384 801.3320 804.4695 820.1236 823.3471 824.1996 860.2536 862.7824 885.3018 898.5666 901.7158 932.0036 944.0964 953.1500 964.8630 988.2615 997.2315 1000.9270 1006.1246 1009.2490 1011.2745 1024.2281 1042.3484 1068.6711 1070.7532 1074.8511 1087.3945 1107.7541 1122.9178 1135.5154 1144.2723 1167.4727 1168.6476 1191.9678 1197.5799 1205.4939 1208.1109 1216.7676 1229.7541 1252.7235 1254.1892 1262.0276 1284.9482 1293.0452 1294.2618 1298.8700 1315.8638 1325.3836 1332.7867 1345.9728 1350.8094 1355.4950 1380.7711 1382.4948 1388.9744 1391.9378 1395.8142 1401.5430 1418.1050 1439.6806 1449.1867 1455.2063 1457.3583 1459.2960 1463.1567 1470.2289 1471.7193 1480.9822 1494.3736 1506.1918 1511.7601 1534.1732 1545.6888 1567.3117 1592.7521 1612.7053 1627.7217 1631.2659 1696.7340 2181.9751 2991.5270 2998.4347 3012.1374 3014.6221 3027.5656 3033.7405 3036.9190 3061.5698 3079.5003 3079.6410 3090.2709 3096.0541 3097.1017 3098.8334 3100.4209 3106.2682 3161.3645 3169.4429 3182.8727 3186.5182 3188.5281 3196.4760 3416.5057
redmass: 6.4951 7.7850 6.8987 7.2007 6.7282 3.7005 1.2196 4.8869 8.2106 4.7374 4.2807 5.4907 3.9838 2.1599 4.3877 6.0871 4.9839 5.8386 6.8632 5.9870 4.8405 5.8135 7.0455 1.7851 2.0486 4.0859 4.5458 3.3365 5.9699 4.4826 3.6247 7.8570 4.4255 5.4308 8.3277 4.7829 4.4752 7.0619 5.6388 6.2056 4.1939 3.3126 6.1723 4.4081 3.9175 3.9428 3.8767 3.6899 4.3224 5.7035 3.0421 4.9507 3.3260 6.2660 5.4943 7.3531 4.1117 5.8400 5.9949 6.6968 5.5466 9.9025 3.8899 3.8589 3.3767 1.3121 1.2120 4.8260 1.5653 1.2113 1.5239 1.6984 2.7374 5.5589 7.2348 1.4670 4.9977 2.8079 1.4686 2.4825 1.3676 2.0719 1.3532 2.0940 2.4020 2.2049 4.0379 1.6428 2.2309 6.8094 2.2390 2.0046 2.3326 2.0822 1.9715 1.2237 2.2728 2.3844 2.7516 3.2444 2.8603 1.1168 3.5757 1.9452 1.5294 1.6759 1.8148 1.2503 1.5041 2.2241 2.0615 1.5210 3.0870 1.4422 1.3912 2.9522 9.5224 3.7776 1.4663 1.4559 1.4345 1.3685 9.0405 4.4854 1.0744 1.0587 1.0945 2.7892 1.1818 1.5519 1.0434 1.5479 1.0871 1.5011 2.2040 1.9678 1.5404 3.6651 8.6265 6.7564 5.2437 8.7146 8.1888 11.5263 12.6335 1.0356 1.0361 1.0605 1.0603 1.0597 1.0597 1.0636 1.1029 1.1028 1.1031 1.0997 1.0985 1.1014 1.1032 1.1051 1.1003 1.0880 1.0876 1.0956 1.0944 1.0955 1.0917 1.0764
irintensity: 0.2106 0.9164 0.1746 0.0510 0.8759 0.5403 1.2436 0.9056 2.5591 4.3770 0.5152 2.9903 1.9551 0.6504 1.8374 5.6431 4.4854 7.9361 2.1491 2.1829 2.4725 4.4577 5.8985 1.5848 1.1090 1.3487 2.8646 5.2897 1.0502 3.3483 2.4755 0.2280 9.7903 5.6809 1.6126 1.0302 0.0625 23.9743 2.5117 4.7210 14.3958 3.4500 2.7807 14.1211 13.1850 7.9644 0.5355 0.6326 1.5282 2.1496 13.4609 3.4823 0.2894 20.6177 2.4279 16.0370 2.4990 34.6055 3.8739 15.7184 6.4190 16.3558 2.4061 1.1544 0.6711 25.4735 13.7576 1.2594 34.3410 29.7986 29.7150 42.5586 5.6688 81.4192 8.7660 40.4683 8.1217 6.0447 25.6095 4.3871 10.4350 70.8788 0.2738 23.4475 38.9658 0.7410 4.3581 15.8348 94.3644 17.9794 37.8874 20.8419 97.0539 46.8240 105.8464 1.1910 37.4639 131.3010 1573.0128 53.0478 880.6547 0.3967 127.9518 51.7291 129.2987 39.0428 143.7746 60.9462 2.6307 114.8898 63.0063 472.7464 719.4210 60.0052 30.1319 125.7195 109.3400 71.2918 131.8901 86.7192 19.9544 23.9819 47.9741 35.5454 1.0159 30.6473 62.8520 101.2135 51.0825 208.6522 14.7218 131.6964 28.3894 22.6908 84.1729 27.2388 68.8701 346.0172 44.9712 325.5773 100.8572 283.7311 976.8489 21.0829 20.1490 27.4399 5.3372 37.7016 17.0460 10.8090 30.5607 2.3898 2.5338 3.9736 0.6243 38.4761 8.2878 6.5751 25.5190 17.0324 12.2657 1.2543 3.1867 15.4560 1.5949 3.8917 8.7328 57.6369
temp: 298.150 k
press: 1.00000 atm
elementType: 8 8 8 8 8 7 7 7 7 7 7 7 6 6 6 6 6 6 6 6 6 6 6 6 6 6 6 6 6 6 6 6 6 6 6 1 1 1 1 1 1 1 1 1 1 1 1 1 1 1 1 1 1 1 1 1 1 1
symmnumber: 1
zpe: 1153225.4 jmol-1
zpe.correction: 0.439240 hartree
zpe.thermalcorrener: 0.471737 hartree
zpe.thermalcorrenthalpy: 0.472681 hartree
zpe.thermalcorrgfe: 0.370247 hartree
zpe.sumelectzpe: -1647.041060 hartree
zpe.sumelectthermal: -1647.008563 hartree
zpe.sumelectthermalent: -1647.007619 hartree
zpe.sumelectthermalfe: -1647.110053 hartree
dipole: -13.5679 -1.5253 0.7822
dipole: 13.6758
quadrupole: -249.6682 -208.5708 -202.9570
quadrupole: -5.1886 5.5799 -2.9107
quadrupole: -29.2695 11.8278 17.4417 -5.1886 5.5799 -2.9107
hfenergy: -1647.4803 hartree
pointgroup: C01 [X(C23H23N7O5)]
dipole: 5.3151678 0.8250138 0.1332794 debye
polarizability: 902.609594|-42.028721|372.1370592|63.0317744|-57.405721|174.5334497 unknown
InChI: InChI=1S/C23H23N7O5/c1-3-28(10-11-29-22(32)8-9-23(29)33)17-4-7-20(21(13-17)25-15(2)31)27-26-19-6-5-18(30(34)35)12-16(19)14-24/h4-7,12-13,25H,3,8-11H2,1-2H3
charge 0 multiplicity 1
58 atoms
O  7.537608 -1.255318 0.164904
O  5.172776 2.177973 -1.970134
O  1.844319 2.885959 0.200116
O  -8.718652 1.74382 -1.060639
O  -9.377692 -0.38095 -0.537068
N  6.095561 0.315152 -0.842653
N  3.282235 -1.73855 0.656417
N  -0.174191 1.707929 -0.001726
N  -2.093614 -0.150365 0.037943
N  -3.052152 -1.069007 0.103527
N  -8.467971 0.522003 -0.713141
N  -4.852104 -4.026089 0.774184
C  4.886445 -0.518659 -0.821707
C  4.379315 -0.752161 0.630845
C  8.359898 1.001166 -0.560994
C  7.571513 2.146612 -1.2422
C  7.343959 -0.124274 -0.347794
C  6.144686 1.617251 -1.419424
C  3.693749 -3.150894 0.869579
C  1.953607 -1.366889 0.509653
C  1.598488 0.005152 0.30468
C  3.606289 -3.586892 2.3491
C  0.900406 -2.357583 0.567145
C  0.252364 0.378589 0.172438
C  -0.428597 -1.986967 0.411143
C  -0.797923 -0.620287 0.206582
C  0.590313 2.877598 0.018347
C  -0.201828 4.160585 -0.206004
C  -4.357869 -0.581657 -0.10862
C  -5.409166 -1.548799 0.070884
C  -4.707418 0.747722 -0.496279
C  -6.759381 -1.183712 -0.126592
C  -7.059103 0.139819 -0.505128
C  -6.043743 1.111591 -0.694143
C  -5.082456 -2.896829 0.455973
H  5.122263 -1.495898 -1.281577
H  4.123384 -0.004611 -1.430843
H  5.212787 -1.151788 1.232686
H  4.065006 0.201884 1.084649
H  9.191147 0.620283 -1.178777
H  8.790498 1.287771 0.413639
H  7.974319 2.42742 -2.229952
H  7.535511 3.068754 -0.637006
H  4.737209 -3.245418 0.519134
H  3.086439 -3.814823 0.229507
H  2.34236 0.799657 0.252469
H  3.939951 -4.6348 2.456059
H  2.57381 -3.510245 2.731096
H  4.254066 -2.95656 2.983885
H  1.137319 -3.409531 0.740126
H  -1.231542 -2.729255 0.44901
H  -1.196074 1.773504 -0.112112
H  -1.29336 4.006485 -0.251359
H  0.130841 4.626222 -1.150415
H  0.027998 4.871193 0.605653
H  -3.90315 1.472996 -0.641748
H  -7.568666 -1.905349 0.007904
H  -6.33029 2.123567 -0.992541
