program: Gaussian 09
title: 000104004
version: EM64L-G09RevD.01
frameworkgroup: C1[X(C21H23BrN6O6)]
method: RPBEPBE
basis: SDD
operation: Freq
keyword: #p
keyword: freq=noraman
keyword: PBEPBE/SDD
title: #p freq=noraman PBEPBE/SDD
converged: YES YES NO NO
title: Mulliken charges:
elementType: Br O O O O O O N N N N N N C C C C C C C C C C C C C C C C C C C C C H H H H H H H H H H H H H H H H H H H H H H H
charge: 0.047150 -0.298716 -0.265801 -0.222721 -0.167985 -0.210807 -0.210469 -0.413422 -0.432899 -0.122014 -0.107814 -0.000388 0.014874 -0.073960 -0.470183 -0.422015 -0.417871 -0.396742 -0.378635 0.374738 0.180231 -0.495285 0.353934 -0.369334 -0.070022 -0.524184 0.218781 -0.795663 0.218287 0.407224 -0.350988 -0.507566 0.440911 -0.375567 0.251043 0.213180 0.222831 0.207401 0.240057 0.190067 0.216763 0.210973 0.204883 0.208278 0.198135 0.345278 0.336436 0.301042 0.379033 0.237737 0.238329 0.244775 0.255017 0.271805 0.248879 0.314411 0.308570
chargesum: 0.00000
title: Mulliken charges with hydrogens summed into heavy atoms:
elementType: Br O O O O O O N N N N N N C C C C C C C C C C C C C C C C C C C C C
charge: 0.047150 -0.298716 -0.265801 -0.222721 -0.167985 -0.210807 -0.210469 -0.068144 -0.053866 -0.122014 -0.107814 -0.000388 0.014874 0.177083 -0.034173 0.025443 -0.011042 0.019114 0.027778 0.374738 0.180231 -0.158849 0.353934 -0.068292 -0.070022 0.196656 0.218781 -0.019962 0.218287 0.407224 -0.350988 -0.193155 0.440911 -0.066997
polarizability: 8.86513975e+02 2.06790565e+01 3.77957157e+02 -2.46713698e+01 -1.78429638e+00 1.81052463e+02
1716.lowfreq: -8.8454 -0.0005 0.0005 0.0007 2.8564 4.9125 12.9232 16.0854 22.6844
frequency: 10.9275 15.8911 22.6317 37.6822 44.8804 51.2438 58.5731 60.6485 63.5204 72.0860 81.2749 87.5936 91.9083 106.3540 107.3501 119.5279 124.8798 142.7621 148.1810 165.3657 175.8260 181.2805 195.7375 200.5638 219.0257 245.1677 251.2381 260.2608 270.0634 295.0059 302.9954 315.2842 318.2580 321.7217 332.1206 357.4024 383.8577 407.0693 421.5668 431.2907 450.9359 476.1841 487.8537 494.6657 509.1767 519.3505 525.7373 531.4328 558.1271 590.8222 597.1193 601.1549 626.3871 629.9689 644.6621 671.5804 681.2623 689.9404 697.4430 704.4933 723.4929 755.7471 764.3289 768.7994 769.6534 792.4217 797.8028 822.9243 837.9176 839.1000 865.0849 873.5065 887.4201 894.9403 915.1393 919.9192 924.7208 927.1718 932.0470 937.2026 974.4719 996.4168 1007.1363 1011.0049 1045.4787 1046.8576 1057.7836 1058.3021 1091.2973 1117.4777 1117.6059 1121.6118 1133.8364 1143.4189 1152.3292 1162.9981 1176.8876 1184.6540 1197.7628 1207.2659 1221.8025 1230.7913 1234.5281 1247.9100 1257.3679 1269.2324 1275.6062 1296.4866 1305.8099 1318.2053 1331.9127 1336.5704 1339.0752 1346.7919 1357.1462 1358.2351 1358.9509 1365.6108 1371.7767 1380.6719 1393.5548 1417.0447 1423.8325 1438.2911 1446.8512 1454.5051 1457.0416 1462.3786 1463.4669 1465.7171 1472.6872 1473.4676 1476.3175 1479.1406 1491.5608 1525.6007 1541.5873 1544.0361 1554.1905 1584.4005 1618.3162 1625.7850 2959.9554 2971.1278 2975.6394 2976.5107 2983.4363 2986.5357 2996.2816 3003.7293 3033.4552 3036.1760 3043.7837 3049.0419 3055.9577 3070.3737 3088.4744 3126.0582 3137.7170 3175.3345 3182.1894 3188.5353 3198.0852 3417.9542 3506.5199
redmass: 5.1901 8.2103 8.4673 7.8945 5.0229 3.3077 6.3024 4.9871 2.0339 4.4200 3.4174 3.0280 9.0914 7.3702 6.0219 5.0858 4.2218 14.1739 6.8447 4.4632 3.6424 5.8488 2.4647 3.1874 4.7124 2.0631 2.5836 8.9146 3.5754 7.7890 4.4129 5.2913 5.4882 4.6804 6.3350 2.3829 5.6473 2.5964 7.5873 4.2294 4.0364 2.8969 3.2400 3.9171 4.8558 6.9927 6.5526 4.6729 4.5908 3.6524 6.4660 4.8957 1.4578 7.3897 2.0233 6.7426 8.5617 7.8767 7.1737 8.6312 7.6006 3.9113 4.6226 4.4710 1.5535 10.3452 3.7036 6.3246 1.7633 1.1916 2.2756 2.2131 1.5051 6.7579 1.4381 1.6444 1.3811 3.4238 1.4947 3.8250 3.6743 2.3588 2.5229 1.9731 1.6501 1.5417 2.2007 1.7359 1.7423 1.1807 1.1741 5.0212 2.7780 2.3216 1.8933 1.6114 3.1467 1.7291 9.9702 3.2406 3.5578 3.3633 1.4642 1.3819 1.4663 1.4902 1.4690 1.6364 5.6064 1.7847 1.3233 1.4663 3.1537 2.8058 4.9968 1.5145 1.6397 1.8191 5.1747 2.9291 1.2208 3.2171 6.5523 1.5677 1.5589 1.1005 1.1607 1.0947 1.1011 1.0488 1.0895 1.0783 1.0808 1.2673 2.5076 3.5875 6.7873 6.1417 3.8360 7.7771 5.1067 7.2924 1.0671 1.0633 1.0628 1.0320 1.0681 1.0621 1.0382 1.0793 1.0938 1.0974 1.1002 1.1019 1.1020 1.1047 1.0958 1.1010 1.1013 1.0915 1.0930 1.0930 1.0923 1.0773 1.0760
irintensity: 0.0065 0.0038 0.0690 0.0521 1.1535 2.2427 0.5944 0.5014 0.7898 1.5036 3.2027 4.8966 2.4146 2.3035 0.0499 1.3588 5.8448 2.3055 1.9645 1.9598 3.1122 0.9724 5.6541 2.5313 2.0930 0.5971 1.6815 0.4167 1.6820 10.0619 1.0640 1.9922 3.7830 3.7863 0.9886 1.5485 2.4653 5.0149 22.0281 0.8040 0.3259 4.9419 15.6876 2.9051 7.3660 3.3757 11.8356 5.3650 15.1431 8.3984 9.1960 54.3696 51.3635 13.8997 32.0155 13.1480 25.3670 8.6564 10.7423 1.9526 11.5982 8.1544 16.2069 2.6489 0.7284 41.2704 2.3627 10.5340 9.7933 50.0024 13.8742 23.8785 20.1735 59.6203 33.7983 8.6906 3.8547 17.9939 34.1114 2.1158 14.0057 15.7236 38.1265 49.5695 14.0564 2.6247 50.5581 8.7801 0.6456 7.8713 8.8495 8.2199 66.9243 32.9354 7.8640 72.5256 93.0716 24.1446 2433.5355 108.4517 279.1584 173.3839 9.8380 37.6596 44.1249 55.9112 143.0524 26.8022 577.6413 304.9319 0.6187 0.0806 30.0234 292.2063 107.9878 6.8187 40.7521 16.6233 247.5563 139.0351 49.4022 68.7705 11.7754 102.9820 288.9380 27.9449 4.6166 2.6775 18.0315 14.4575 46.3762 22.3546 82.7301 98.9531 261.3959 2.3330 393.5269 452.5564 217.8457 203.4838 76.2436 503.5472 26.4055 48.9652 26.8831 36.3245 7.1364 12.7896 5.3303 46.2163 98.1004 65.0449 28.3760 27.5528 122.4700 30.8556 5.8500 4.5365 20.3548 8.9579 10.1268 9.6068 13.2843 38.9446 280.8041
temp: 298.150 k
press: 1.00000 atm
elementType: 35 8 8 8 8 8 8 7 7 7 7 7 7 6 6 6 6 6 6 6 6 6 6 6 6 6 6 6 6 6 6 6 6 6 1 1 1 1 1 1 1 1 1 1 1 1 1 1 1 1 1 1 1 1 1 1 1
symmnumber: 1
zpe: 1126394.1 jmol-1
zpe.correction: 0.429021 hartree
zpe.thermalcorrener: 0.461787 hartree
zpe.thermalcorrenthalpy: 0.462731 hartree
zpe.thermalcorrgfe: 0.360637 hartree
zpe.sumelectzpe: -1604.676037 hartree
zpe.sumelectthermal: -1604.643271 hartree
zpe.sumelectthermalent: -1604.642327 hartree
zpe.sumelectthermalfe: -1604.744420 hartree
dipole: -12.1464 -5.1213 -0.0256
dipole: 13.1819
quadrupole: -227.4921 -201.0987 -210.2385
quadrupole: 7.1236 -1.7501 -6.7920
quadrupole: -14.5490 11.8444 2.7046 7.1236 -1.7501 -6.7920
hfenergy: -1605.1050574 hartree
pointgroup: C01[X(C21H23Br1N6O6)]
dipole: -4.8985107 1.7020696 -0.0619072 debye
polarizability: 883.5640665|8.8316074|376.1026764|55.9287762|16.1879364|185.8568513 unknown
InChI: InChI=1S/C21H23BrN6O6/c1-12(29)23-16-10-18(24-13-6-4-3-5-7-13)20(34-2)11-17(16)25-26-21-15(22)8-14(27(30)31)9-19(21)28(32)33/h8-11,13,23-24H,3-7H2,1-2H3
charge 0 multiplicity 1
57 atoms
Br 3.292241 3.631821 1.194889
O  -3.13419 2.80815 -0.536659
O  -2.345468 -3.678989 0.199051
O  2.743883 -2.5938 -0.055098
O  2.448773 -1.280979 -1.903134
O  7.758412 -1.071978 0.431952
O  8.058823 1.08501 1.132805
N  -4.576779 0.6053 -0.494322
N  -0.560808 -2.154767 0.23277
N  0.937249 0.06478 0.186872
N  1.715993 1.149061 0.217619
N  2.877295 -1.480039 -0.706321
N  7.315475 0.111438 0.714602
C  -5.596675 -0.469089 -0.497589
C  -6.86638 0.041653 -1.224837
C  -5.94395 -0.941011 0.945333
C  -7.624088 1.124486 -0.415995
C  -6.689953 0.147508 1.751103
C  -7.96147 0.628439 1.010698
C  -3.233107 0.433801 -0.312034
C  -2.398654 1.630937 -0.339282
C  -2.627762 -0.837331 -0.11459
C  -1.233529 -0.939303 0.046492
C  -1.027738 1.542525 -0.181495
C  -0.411557 0.260482 0.016608
C  -2.382182 4.068545 -0.589074
C  -1.102865 -3.447753 0.294435
C  -0.073031 -4.546292 0.512775
C  3.077825 0.856998 0.270724
C  3.681251 -0.406267 -0.074441
C  3.989177 1.87477 0.712112
C  5.043029 -0.675582 0.087602
C  5.875063 0.364044 0.55173
C  5.361647 1.648047 0.853955
H  -5.178018 -1.32415 -1.063762
H  -7.536773 -0.826659 -1.373067
H  -6.597549 0.415611 -2.231618
H  -6.582198 -1.842843 0.857138
H  -5.022836 -1.25156 1.471589
H  -7.020137 2.054184 -0.345099
H  -8.548134 1.404108 -0.95623
H  -6.954987 -0.247828 2.749709
H  -6.013089 1.009301 1.921808
H  -8.459542 1.43215 1.585653
H  -8.683242 -0.211431 0.94199
H  -4.887441 1.572651 -0.626516
H  -3.218593 -1.752581 -0.0897
H  -0.366529 2.412773 -0.192976
H  0.461672 -2.05893 0.315396
H  -1.848443 4.243801 0.363605
H  -1.660129 4.056891 -1.426607
H  -3.135956 4.852135 -0.750241
H  -0.413539 -5.458472 -0.001201
H  0.931599 -4.267533 0.153983
H  -0.00527 -4.777164 1.592432
H  5.471867 -1.650608 -0.15825
H  6.042816 2.426738 1.204305
