program: Gaussian 09
title: 000103843
version: EM64L-G09RevD.01
frameworkgroup: C1[X(C14H24N2O2S)]
method: RPBEPBE
basis: SDD
operation: Freq
keyword: #p
keyword: freq=noraman
keyword: PBEPBE/SDD
title: #p freq=noraman PBEPBE/SDD
converged: YES YES NO NO
title: Mulliken charges:
elementType: S O O N N C C C C C C C C C C C C C C H H H H H H H H H H H H H H H H H H H H H H H H
charge: 0.981305 -0.542877 -0.540209 -0.516962 -0.687746 0.009192 -0.375263 -0.469737 -0.405914 -0.380657 -0.360539 -0.719924 -0.701623 -0.108242 -0.232247 -0.200416 -0.387981 -0.401024 0.510999 0.186578 0.222569 0.175563 0.227828 0.270077 0.207990 0.208880 0.171982 0.237105 0.185828 0.202953 0.296814 0.213465 0.215009 0.219811 0.222360 0.211453 0.203446 0.281192 0.278707 0.230591 0.230590 0.314680 0.314397
chargesum: 0.00000
title: Mulliken charges with hydrogens summed into heavy atoms:
elementType: S O O N N C C C C C C C C C C C C C C
charge: 0.981305 -0.542877 -0.540209 -0.220149 -0.058669 0.195770 0.022868 0.028168 0.010956 0.028430 0.028242 -0.071638 -0.064365 -0.108242 0.048946 0.078290 -0.157389 -0.170434 0.510999
polarizability: 2.69952784e+02 1.25967062e+01 1.66970609e+02 -1.41635586e+01 6.36275840e+00 1.81246176e+02
1716.lowfreq: -11.9769 -4.8434 0.0019 0.0027 0.0027 4.5898 15.1944 18.3526 23.3357
frequency: 14.7676 16.7183 21.1632 38.0253 53.4778 59.9925 89.7297 98.3957 107.1897 113.7979 132.3901 140.2824 158.9524 209.0205 225.5677 232.8740 237.9528 267.5781 270.5982 290.0731 294.8693 322.4640 345.4436 354.6898 398.7333 404.8224 411.9226 418.0334 425.1831 445.7544 457.2971 486.0847 517.7667 566.6823 597.1907 622.5303 706.7741 719.7906 732.1986 763.6399 785.9698 801.1764 814.0856 816.8497 826.8418 833.4983 892.3087 895.1700 918.2830 945.8269 951.1233 963.0021 977.7142 981.8343 1002.8669 1012.3234 1021.0955 1037.4358 1048.0037 1053.9438 1086.9752 1090.2798 1122.3183 1129.0127 1130.3365 1159.3456 1181.6024 1209.3348 1224.7442 1241.8042 1256.5823 1270.6667 1288.5876 1296.6812 1300.8539 1319.6340 1322.6529 1333.2014 1338.4003 1351.4800 1359.7033 1368.1557 1384.4707 1391.5409 1397.0431 1431.1640 1452.8392 1467.1119 1471.8958 1475.0505 1476.2687 1478.4355 1484.4630 1487.1571 1487.4602 1490.6725 1584.2684 1613.2631 1648.2034 2937.3053 2945.9993 2952.7011 2960.4884 2964.4800 2970.2474 2970.6470 2971.8888 3000.2933 3016.8502 3021.0572 3041.7335 3046.2430 3063.5612 3065.7711 3069.9333 3071.4288 3131.2251 3133.6722 3157.1053 3161.9454 3427.4901 3562.8935 3701.8051
redmass: 4.7237 4.5387 3.1387 3.8385 2.3575 2.3842 3.9493 2.7949 3.8148 2.6332 2.9565 4.3985 2.2355 3.6376 1.4025 2.9784 1.3863 3.2947 4.1256 5.8262 3.5622 2.8541 3.6073 3.4380 3.1928 1.0492 2.7472 3.3828 1.6095 2.7343 7.4486 2.5348 2.7303 2.0767 7.0582 6.9159 2.0106 2.5265 1.0976 1.2135 1.8686 5.7178 6.4751 1.2669 1.5037 1.8787 1.8872 1.9978 1.3492 4.6618 1.3420 1.3699 2.0910 4.9068 2.2299 2.2152 1.4430 1.5964 2.5251 2.7006 2.6046 1.9925 1.7450 1.3405 1.5933 2.8658 1.1192 1.3989 1.2415 1.2680 1.1947 1.2738 1.2085 1.3008 1.1129 2.6182 1.2894 1.3785 1.3983 1.4461 1.5154 1.2675 1.2174 1.2121 5.5459 3.6974 1.0796 1.0650 1.0575 1.0490 1.0518 1.0628 1.0774 2.7707 1.0996 1.0659 7.3678 4.7587 1.2266 1.0749 1.0617 1.0723 1.0617 1.0614 1.0374 1.0529 1.0442 1.0935 1.0996 1.1006 1.1017 1.0936 1.0998 1.0999 1.0991 1.1002 1.0888 1.0889 1.0956 1.0962 1.0759 1.0453 1.1040
irintensity: 2.3222 1.1741 0.7002 0.4819 0.8378 0.0842 1.6331 0.2895 3.1662 0.2302 2.5590 1.0788 1.9688 5.9832 0.1291 1.9826 0.6609 1.6341 4.7415 2.2498 1.6719 2.2102 3.7998 39.6840 2.6680 0.6036 0.1181 47.9989 274.0127 0.6292 224.9315 1.3601 40.1999 10.9485 30.8821 0.4595 16.0004 5.2724 10.2814 8.3238 5.4388 29.7452 105.8586 0.5553 1.2359 64.0791 5.8384 17.5018 23.5652 49.4832 1.3296 0.4359 21.8417 4.3130 0.6434 4.4519 1.0310 1.7970 51.2623 2.1907 0.9952 13.2778 11.0233 11.2157 4.6342 1.4795 41.8806 3.2298 22.1175 0.9300 2.4189 5.3774 0.5166 4.8795 2.1618 81.8327 4.1595 1.8686 7.5645 12.5784 0.5712 0.7536 12.1030 13.4632 5.8824 1.4484 2.9808 0.8201 8.5480 8.2416 10.3079 4.7429 47.0386 79.5460 5.4930 11.9559 6.9313 154.3839 267.8378 10.3380 8.4774 58.3960 10.3430 65.9984 41.2382 89.9917 15.5664 6.5192 17.5299 0.3423 49.4422 7.5224 83.9378 77.7336 45.0266 74.5989 12.7080 13.8121 5.1167 10.6811 14.3417 111.0445 25.2727
temp: 298.150 k
press: 1.00000 atm
elementType: 16 8 8 7 7 6 6 6 6 6 6 6 6 6 6 6 6 6 6 1 1 1 1 1 1 1 1 1 1 1 1 1 1 1 1 1 1 1 1 1 1 1 1
symmnumber: 1
zpe: 946845.4 jmol-1
zpe.correction: 0.360634 hartree
zpe.thermalcorrener: 0.383343 hartree
zpe.thermalcorrenthalpy: 0.384287 hartree
zpe.thermalcorrgfe: 0.305544 hartree
zpe.sumelectzpe: -1204.234795 hartree
zpe.sumelectthermal: -1204.212086 hartree
zpe.sumelectthermalent: -1204.211142 hartree
zpe.sumelectthermalfe: -1204.289886 hartree
dipole: 6.2250 4.9900 -4.5213
dipole: 9.1702
quadrupole: -84.2722 -132.6418 -125.9087
quadrupole: 0.9844 -8.8198 7.9509
quadrupole: 30.0020 -18.3676 -11.6344 0.9844 -8.8198 7.9509
hfenergy: -1204.5954294 hartree
pointgroup: C01 [X(C14H24N2O2S1)]
dipole: -2.4452085 -1.9386213 -1.8108616 debye
polarizability: 269.8968632|12.4933708|167.1916463|14.452959|-6.5476813|181.08106 unknown
InChI: InChI=1S/C14H24N2O2S/c1-3-5-6-12(4-2)11-16-19(17,18)14-9-7-13(15)8-10-14/h7-10,12,16H,3-6,11,15H2,1-2H3
charge 0 multiplicity 1
43 atoms
S  -0.395503 0.919981 1.131538
O  0.327613 2.07335 0.237578
O  -0.619548 1.019355 2.738709
N  0.681613 -0.558407 0.917565
N  -5.831015 -0.103322 -1.384683
C  2.436497 -1.614143 -0.498574
C  3.574022 -0.714499 0.051951
C  1.059742 -0.891397 -0.475108
C  2.403478 -2.97442 0.250727
C  3.776583 0.618522 -0.704273
C  5.051506 1.369082 -0.25394
C  1.383127 -3.997539 -0.296147
C  5.238954 2.718275 -0.980751
C  -2.075258 0.600871 0.349772
C  -3.095039 0.045641 1.145849
C  -2.272714 0.947793 -0.999803
C  -4.35199 -0.189353 0.56261
C  -3.530929 0.709837 -1.579999
C  -4.587592 0.13189 -0.810438
H  2.641638 -1.820232 -1.573547
H  3.367861 -0.49683 1.118077
H  4.518655 -1.297437 0.016982
H  0.290455 -1.505729 -0.990163
H  1.150782 0.064391 -1.021367
H  3.417923 -3.41727 0.197155
H  2.214485 -2.787451 1.327763
H  3.837529 0.423847 -1.797195
H  2.903157 1.280769 -0.542053
H  5.938531 0.724765 -0.426329
H  4.999194 1.543229 0.840009
H  0.279232 -1.322866 1.483387
H  0.339463 -3.646751 -0.18765
H  1.556748 -4.196333 -1.370773
H  1.463437 -4.960381 0.241105
H  4.378446 3.387128 -0.792737
H  6.154047 3.238757 -0.642261
H  5.317401 2.571847 -2.07511
H  -2.913435 -0.164264 2.205304
H  -1.466518 1.422214 -1.568798
H  -5.161898 -0.612332 1.16822
H  -3.706339 0.98006 -2.627749
H  -6.013693 0.141021 -2.353839
H  -6.592647 -0.495969 -0.838714
