program: Gaussian 09
title: 000103808
version: EM64L-G09RevD.01
frameworkgroup: C1[X(C8H16O3)]
method: RPBEPBE
basis: SDD
operation: Freq
keyword: #pfreq=noraman
keyword: PBEPBE/SDD
title: #p freq=noraman PBEPBE/SDD
converged: YES YES NO NO
title: Mulliken charges:
elementType: O O O C C C C C C C C H H H H H H H H H H H H H H H H
charge: -0.254814 -0.465763 -0.276326 -0.367167 -0.025380 -0.521875 -0.345424 -0.268565 0.276186 -0.686950 -0.685832 0.208625 0.209775 0.194628 0.253475 0.236212 0.198184 0.197344 0.226024 0.226674 0.221463 0.197084 0.241509 0.212666 0.212333 0.220236 0.365678
chargesum: 0.00000
title: Mulliken charges with hydrogens summed into heavy atoms:
elementType: O O O C C C C C C C C
charge: -0.254814 -0.100086 -0.276326 0.051233 0.169249 -0.032187 0.050104 0.184132 0.276186 -0.026893 -0.040598
polarizability: 1.31828947e+02 -6.53774166e-01 9.04845694e+01 -4.87529672e-01 5.48665361e-01 7.50391353e+01
1716.lowfreq: -12.2090 -1.9458 0.0007 0.0008 0.0008 5.4061 21.0088 45.7549 58.0354
frequency: 20.3020 45.6232 58.0076 64.9042 106.7517 109.7144 159.2059 199.1213 204.9702 227.8151 236.8803 258.1395 328.1499 390.6509 409.8585 445.3410 472.1436 579.0470 602.4817 702.3318 738.5703 795.7283 815.7694 856.4978 899.1343 905.0460 915.6247 930.6336 954.4746 1041.1619 1051.3616 1079.1534 1083.0182 1125.3712 1128.0371 1145.2794 1148.6703 1206.6934 1212.1276 1269.7533 1271.0218 1271.8247 1287.1512 1307.1266 1324.6871 1344.3636 1372.1756 1383.0910 1393.0734 1404.3680 1417.6035 1457.2400 1468.3977 1472.1181 1478.5784 1479.3325 1480.6959 1490.3053 1606.6052 2935.3666 2969.9886 2976.7357 2990.3948 2992.5403 2994.9156 3004.7954 3013.3948 3046.7156 3070.6988 3071.5876 3078.0397 3081.0484 3089.6880 3101.7077 3443.1850
redmass: 4.3107 2.6491 2.3884 4.2102 2.8338 2.2828 3.5671 2.6474 1.0524 4.4041 1.1516 4.2431 4.1171 3.8482 3.0659 2.3505 2.7576 3.3560 1.1050 6.2595 1.0698 1.1396 3.4651 4.0353 2.7601 1.7154 1.9594 1.1659 3.3022 3.2998 2.3450 1.9254 2.0240 2.6112 2.2443 1.6815 2.1605 1.3360 1.3417 1.2348 1.1570 1.1967 1.0799 1.6999 1.2068 1.4665 1.5833 1.2599 1.2172 1.6063 1.1096 1.0519 1.0820 1.0680 1.0422 1.0470 1.0638 1.0892 8.6789 1.0844 1.0589 1.0365 1.0370 1.0599 1.0617 1.0567 1.1005 1.1036 1.0972 1.1027 1.0994 1.1066 1.0997 1.0996 1.0651
irintensity: 1.0060 0.2618 1.0629 0.2370 0.5373 0.7350 1.0175 7.7508 0.2347 1.3443 0.5346 11.9317 8.9756 4.4006 13.0753 12.1371 3.0426 21.9089 200.1559 2.0758 9.4432 0.4060 13.3835 5.6283 27.4997 2.1770 3.8579 0.4520 40.2301 25.1326 35.5423 67.5726 5.2823 3.4096 9.3047 113.8072 248.1053 55.2586 8.8067 10.0379 32.7121 24.7370 0.1122 99.2809 12.4796 4.0106 7.4976 16.1341 8.2013 83.3517 32.2968 9.0061 0.3787 0.3365 13.3156 8.3736 5.1934 20.6570 165.5625 57.8833 27.6913 30.6548 19.7301 19.1715 8.3017 36.3523 6.9931 3.1068 6.0282 13.1928 47.4357 105.8144 43.7758 28.3812 76.6760
temp: 298.150 k
press: 1.00000 atm
elementType: 8 8 8 6 6 6 6 6 6 6 6 1 1 1 1 1 1 1 1 1 1 1 1 1 1 1 1
symmnumber: 1
zpe: 607069.6 jmol-1
zpe.correction: 0.231221 hartree
zpe.thermalcorrener: 0.245016 hartree
zpe.thermalcorrenthalpy: 0.245960 hartree
zpe.thermalcorrgfe: 0.188979 hartree
zpe.sumelectzpe: -539.215202 hartree
zpe.sumelectthermal: -539.201407 hartree
zpe.sumelectthermalent: -539.200462 hartree
zpe.sumelectthermalfe: -539.257444 hartree
dipole: -3.5197 -2.1033 0.4792
dipole: 4.1282
quadrupole: -72.5009 -71.1620 -66.4060
quadrupole: -9.1103 2.2427 -0.1261
quadrupole: -2.4779 -1.1391 3.6169 -9.1103 2.2427 -0.1261
hfenergy: -539.4464227 hartree
pointgroup: C01 [X(C8H16O3)]
dipole: -1.3715272 -0.7008511 0.5153615 debye
polarizability: 131.841042|-0.1401464|88.3224604|-0.3558388|-5.3739168|77.1891489 unknown
InChI: InChI=1S/C8H16O3/c1-3-4-5-11-8(10)6-7(2)9/h7,9H,3-6H2,1-2H3
charge 0 multiplicity 1
27 atoms
O  -0.429191 -0.424091 -0.038656
O  3.654864 0.92716 -0.767212
O  0.880907 1.405843 -0.616367
C  -2.862929 -0.474936 0.05491
C  3.26448 -0.00483 0.29788
C  1.956589 -0.753635 -0.07603
C  -4.194412 0.287555 -0.148357
C  -1.656978 0.409977 -0.255472
C  0.788091 0.195353 -0.273306
C  4.437774 -0.971801 0.479988
C  -5.426013 -0.586573 0.170188
H  -2.793447 -0.836228 1.098876
H  -2.839193 -1.368644 -0.597792
H  3.090786 0.554377 1.244996
H  2.122985 -1.292297 -1.030594
H  1.68834 -1.507738 0.684421
H  -4.257534 0.64877 -1.194814
H  -4.205735 1.190625 0.495263
H  -1.652739 0.766169 -1.30228
H  -1.597808 1.291271 0.409424
H  4.62425 -1.525506 -0.457467
H  4.239166 -1.695053 1.291753
H  5.350432 -0.403941 0.727099
H  -5.458596 -1.479705 -0.481465
H  -5.403626 -0.936722 1.219128
H  -6.365853 -0.02491 0.021082
H  2.877787 1.534411 -0.920793
