program: Gaussian 09
title: 000103870
version: EM64L-G09RevD.01
frameworkgroup: C1[X(C24H28N3)]
method: RPBEPBE
basis: SDD
operation: Freq
keyword: #p
keyword: freq=noraman
keyword: PBEPBE/SDD
title: #p freq=noraman PBEPBE/SDD
converged: YES YES NO NO
title: Mulliken charges:
elementType: N N N C C C C C C C C C C C C C C C C C C C C C C C C H H H H H H H H H H H H H H H H H H H H H H H H H H H H
charge: -0.198565 -0.126364 0.019060 -0.063313 0.336776 0.364506 0.236360 -0.675659 -0.679386 -0.409413 -0.302950 -0.352723 -0.658434 -0.233960 -0.217989 -0.295278 0.517972 0.443913 -0.393896 -0.419266 -0.361832 -0.363160 -0.456266 -0.398980 -0.412454 -0.645730 -0.145283 0.242389 0.237365 0.222261 0.243088 0.216628 0.240493 0.255289 0.223337 0.250740 0.259230 0.259361 0.266229 0.250104 0.250696 0.244472 0.231021 0.239140 0.250132 0.250525 0.260870 0.271352 0.241960 0.236087 0.275750 0.264968 0.242325 0.235433 0.231068
chargesum: 1.00000
title: Mulliken charges with hydrogens summed into heavy atoms:
elementType: N N N C C C C C C C C C C C C C C C C C C C C C C C C
charge: -0.198565 -0.126364 0.019060 -0.063313 0.336776 0.364506 0.236360 0.026356 0.020823 -0.154124 -0.079613 -0.101983 0.126386 0.016144 0.032707 -0.050806 0.517972 0.443913 -0.162875 -0.180126 -0.111700 -0.112635 0.075956 0.079067 0.128265 0.063097 -0.145283
polarizability: 8.31545604e+02 3.33886235e+01 2.72379699e+02 -6.29329162e+00 1.34546077e+01 1.51282165e+02
1716.lowfreq: -3.1645 -0.0009 0.0003 0.0010 3.5186 5.0691 15.6954 20.5277 25.8434
frequency: 14.8309 20.3089 25.7852 37.6303 49.2460 63.1756 76.4811 86.6713 98.7973 102.9564 124.6630 140.7037 150.0183 165.4843 174.6626 187.2500 206.7536 215.6069 225.1729 242.7909 258.9482 264.7401 277.1751 283.8710 311.6581 315.1905 342.8972 354.4886 364.2846 368.9003 396.5260 405.1403 431.4609 439.4133 466.6361 472.1368 504.2856 521.1905 539.0553 544.7936 565.4474 570.1504 581.8881 616.1512 631.5007 685.4198 698.7904 727.2576 743.5601 754.8010 767.1480 768.6584 773.5218 793.5844 799.9580 826.4480 829.5336 870.5791 874.1009 897.1650 906.0924 932.3785 942.9522 945.0489 946.7006 951.8197 966.5901 975.5366 985.4189 990.8472 996.9783 1006.2319 1011.4601 1013.9222 1026.6219 1044.5022 1065.0043 1078.7830 1114.6875 1115.0689 1124.9616 1127.3368 1131.2472 1143.1106 1176.8524 1182.8567 1188.1601 1210.6914 1215.1892 1220.7007 1244.4634 1265.0647 1276.4828 1283.0215 1290.6134 1290.7241 1293.4590 1307.4656 1337.1633 1341.0655 1353.3903 1369.0862 1383.3411 1391.8701 1397.6319 1404.3556 1410.3807 1413.2129 1439.0595 1451.0356 1453.4128 1459.2331 1461.3834 1464.9872 1469.9321 1474.9921 1477.7671 1480.5583 1481.8744 1485.0191 1487.3963 1498.3459 1508.5920 1519.9245 1530.0338 1544.9812 1593.9376 1609.4285 1621.9079 1641.4764 2205.8492 2991.0478 2992.0950 2995.2145 2998.6293 3003.9221 3016.0137 3033.6880 3057.4051 3064.3866 3089.3098 3091.5729 3093.6753 3094.5296 3096.2045 3098.4385 3100.2808 3101.6672 3125.7836 3127.9285 3128.5537 3141.1759 3143.2600 3145.2190 3151.4318 3163.5305 3173.0368 3179.8320 3181.8529
redmass: 4.1874 5.4481 6.4840 4.6537 4.1238 3.2835 3.4977 3.0564 3.7676 2.9719 3.3242 4.4253 3.2006 3.9099 2.4753 2.7024 1.2168 1.1454 1.8240 1.5403 1.5194 2.2303 3.8488 2.7407 2.6721 2.9194 3.6613 3.0073 3.3053 2.8898 3.3736 3.7344 3.2242 3.5979 3.9032 4.0304 3.0784 3.3273 4.1663 4.1211 3.5083 3.7782 4.4273 3.9238 6.0330 4.6612 4.9936 4.4032 3.9092 2.8376 1.9146 2.4344 1.2191 1.1863 1.2964 1.9450 3.1491 1.3819 1.8037 2.4889 3.0210 2.6941 1.4946 3.5629 1.3546 1.3822 1.3683 1.3628 2.9432 3.0637 1.3400 3.6199 1.3016 2.7297 2.2169 1.8748 2.7191 2.0165 1.7329 1.6961 1.7890 2.5740 1.7731 1.6570 1.9639 1.2540 2.1439 1.5268 1.7571 1.3247 2.8813 1.4394 1.2719 1.2872 1.8615 1.4427 1.7216 1.5776 1.4078 1.2902 1.3069 2.8100 1.1658 1.8584 1.2300 1.9126 2.5368 2.0536 1.4220 2.2905 1.0963 1.0698 2.0022 1.0514 1.0441 1.5566 1.1140 1.1145 1.2831 1.2500 1.2101 1.2253 1.7192 1.6265 5.1176 3.6914 4.2728 7.1117 7.3219 6.3714 12.4408 1.0346 1.0349 1.0360 1.0365 1.0592 1.0610 1.0603 1.1017 1.1028 1.1006 1.1009 1.1002 1.1053 1.1002 1.1016 1.1018 1.1012 1.0962 1.0920 1.0908 1.0870 1.0884 1.0875 1.0894 1.0946 1.0937 1.1003 1.0944
irintensity: 1.2761 0.3634 2.4071 1.6370 0.0445 1.5167 2.3490 1.3977 0.2620 1.2868 0.2724 1.3381 2.8548 5.3449 1.0086 1.0332 0.9719 0.1779 0.4468 1.1969 0.1450 4.8810 0.6356 0.3633 1.6331 0.1840 5.5479 1.4235 2.0455 2.5582 2.9586 2.0554 1.6420 8.8442 24.9584 8.7916 19.0020 4.5888 5.6240 0.7052 2.1439 1.1847 2.8574 1.9243 0.9365 8.5442 1.7825 65.2308 6.4584 9.8957 52.2121 24.0636 5.1923 21.9897 1.2714 52.8054 16.4399 0.1454 11.9895 4.1399 8.0686 65.8866 0.9857 6.8016 24.1026 1.2290 5.7340 26.3653 0.6035 50.0357 0.1199 12.0687 1.5195 50.4004 1.5273 13.4781 9.3890 60.5421 12.5236 18.9835 53.2339 2.9787 6.8670 1.5520 92.1237 6.9870 8.5403 141.0057 224.3995 36.7613 22.3822 2.5290 87.4209 4.3534 38.8873 4.2705 90.6877 40.4669 54.5761 121.9411 214.9767 80.4046 13.4125 86.5002 33.0589 15.5374 21.0482 500.8644 9.9667 73.5597 8.9588 1.4581 7.1042 7.0118 15.5708 15.0666 16.3787 16.0729 20.0291 19.8993 21.6466 30.3771 4.0161 37.0707 18.0266 1015.4726 1860.6892 2.4893 189.0596 79.2952 9.2785 13.3805 15.3373 17.7201 10.0993 1.6581 43.2151 33.6989 1.7193 2.4251 1.6801 7.3874 35.3442 8.2769 22.5327 10.7045 44.1221 19.2651 3.7496 7.8950 3.8427 3.6809 3.2343 7.5912 1.2636 8.6531 16.3638 18.7096 14.1421
temp: 298.150 k
press: 1.00000 atm
elementType: 7 7 7 6 6 6 6 6 6 6 6 6 6 6 6 6 6 6 6 6 6 6 6 6 6 6 6 1 1 1 1 1 1 1 1 1 1 1 1 1 1 1 1 1 1 1 1 1 1 1 1 1 1 1 1
symmnumber: 1
zpe: 1212886.6 jmol-1
zpe.correction: 0.461964 hartree
zpe.thermalcorrener: 0.488745 hartree
zpe.thermalcorrenthalpy: 0.489690 hartree
zpe.thermalcorrgfe: 0.402996 hartree
zpe.sumelectzpe: -1093.430842 hartree
zpe.sumelectthermal: -1093.404061 hartree
zpe.sumelectthermalent: -1093.403117 hartree
zpe.sumelectthermalfe: -1093.489811 hartree
dipole: -4.6271 2.7665 0.9930
dipole: 5.4818
quadrupole: -63.5940 -135.9608 -160.7389
quadrupole: 39.3112 6.3000 2.1848
quadrupole: 56.5039 -15.8629 -40.6410 39.3112 6.3000 2.1848
hfenergy: -1093.8928065 hartree
pointgroup: C01 [X(C24H28N3)]
dipole: 1.8258535 -1.0436875 -0.4777971 debye
polarizability: 830.4960982|41.8598313|240.1990588|-12.8882574|54.3833358|184.5123114 unknown
InChI: InChI=1S/C24H28N3/c1-5-27(18-8-17-25)20-14-11-19(12-15-20)13-16-23-24(2,3)21-9-6-7-10-22(21)26(23)4/h6-7,9-16H,5,8,18H2,1-4H3
charge 1 multiplicity 1
55 atoms
N  3.51047 0.905351 0.63044
N  -5.202334 -0.762795 -0.063905
N  -8.305437 2.166429 2.395863
C  3.895004 -0.938755 -0.821131
C  5.203385 -0.243349 -0.457944
C  2.856908 -0.079275 -0.066333
C  4.929842 0.850114 0.396359
C  3.63222 -0.898546 -2.356906
C  3.872271 -2.411567 -0.305987
C  6.526548 -0.523769 -0.829846
C  1.46602 -0.351249 -0.136922
C  5.936258 1.696749 0.894967
C  2.912978 1.866359 1.570417
C  7.562233 0.310577 -0.336438
C  7.267975 1.405899 0.512216
C  0.377999 0.439634 0.258279
C  -1.012958 0.094704 0.153406
C  -3.85014 -0.479984 0.003488
C  -1.499703 -1.168896 -0.326851
C  -2.002038 1.056619 0.550645
C  -2.860176 -1.449329 -0.404299
C  -3.367381 0.790509 0.484729
C  -6.222777 0.248641 0.279048
C  -5.716978 -2.086879 -0.511178
C  -6.518956 0.278364 1.813011
C  -5.854497 -2.196598 -2.045157
C  -7.507139 1.315415 2.148576
H  3.647553 0.135281 -2.742107
H  4.415919 -1.472695 -2.88084
H  2.655399 -1.350379 -2.603888
H  4.037274 -2.463111 0.783811
H  2.911411 -2.902352 -0.541677
H  4.67416 -2.984873 -0.802546
H  6.765126 -1.36577 -1.488211
H  1.24166 -1.306949 -0.624387
H  5.724998 2.553604 1.541366
H  2.489599 2.738294 1.04046
H  3.688447 2.220093 2.265496
H  2.123456 1.372296 2.159845
H  8.600982 0.109931 -0.616473
H  8.080958 2.041535 0.876751
H  0.568626 1.444177 0.65406
H  -0.794433 -1.943284 -0.646567
H  -1.672912 2.034963 0.922076
H  -3.17215 -2.4214 -0.792458
H  -4.065518 1.566128 0.808805
H  -5.911202 1.248422 -0.066776
H  -7.151226 0.003362 -0.263485
H  -6.70524 -2.231142 -0.038849
H  -5.067173 -2.885952 -0.113954
H  -5.587753 0.46933 2.377937
H  -6.899814 -0.706521 2.142051
H  -6.266702 -3.184719 -2.315865
H  -4.880652 -2.078489 -2.550929
H  -6.538589 -1.424852 -2.439892
