program: Gaussian 09
title: 000103821
version: EM64L-G09RevD.01
frameworkgroup: C1[X(C12H22O2)]
method: RPBEPBE
basis: SDD
operation: Freq
keyword: #pfreq=noraman
keyword: PBEPBE/SDD
title: #p freq=noraman PBEPBE/SDD
converged: YES YES NO NO
title: Mulliken charges:
elementType: O O C C C C C C C C C C C C H H H H H H H H H H H H H H H H H H H H H H
charge: -0.256038 -0.257250 -0.444884 0.536885 -0.342092 -0.536141 -0.381653 -0.374958 -0.346510 -0.511519 -0.689758 -0.694119 0.295316 -0.751238 0.208529 0.197691 0.204196 0.208639 0.191523 0.206557 0.217737 0.229467 0.203406 0.192937 0.196702 0.243199 0.230988 0.221203 0.217394 0.204690 0.216480 0.211582 0.210146 0.248660 0.248766 0.243467
chargesum: 0.00000
title: Mulliken charges with hydrogens summed into heavy atoms:
elementType: O O C C C C C C C C C C C C
charge: -0.256038 -0.257250 -0.038665 0.536885 0.055988 -0.123306 -0.163915 0.057914 0.043129 -0.037333 -0.046471 -0.055911 0.295316 -0.010344
polarizability: 1.83062901e+02 5.09160925e+00 1.29425523e+02 1.00402746e+01 7.10530958e-01 1.13301532e+02
1716.lowfreq: -11.2152 -0.0004 0.0003 0.0005 4.1035 8.2747 16.2705 28.7344 40.2180
frequency: 16.1431 28.5964 40.1707 44.4844 46.4472 64.7520 68.8591 90.1807 99.5873 108.3982 170.8582 199.4212 213.7975 222.8689 230.7115 274.4362 289.1206 314.1614 343.6278 398.5222 445.1735 479.1889 528.0936 558.6781 601.8271 631.8964 727.1266 743.8884 773.2456 780.4749 813.5118 857.7913 873.9100 890.9127 901.3671 919.3842 928.4886 984.3098 994.7149 1010.8591 1041.6871 1042.9139 1052.6507 1068.1805 1087.6221 1094.1389 1103.5322 1133.7279 1198.0857 1201.4742 1218.9013 1237.0874 1241.4422 1256.3855 1270.9877 1275.0025 1285.4237 1290.1705 1316.6967 1334.3304 1347.2587 1347.7258 1377.7677 1382.8290 1388.4740 1388.6706 1453.4743 1454.7821 1457.3148 1460.8102 1466.1446 1471.1850 1475.2950 1476.4177 1476.6966 1479.8961 1487.0289 1493.1113 1642.6228 1677.1119 2955.0778 2961.5050 2970.5077 2971.9149 2972.9826 2976.8221 2987.9410 3002.3520 3007.4253 3014.9623 3021.4419 3026.6263 3042.1305 3047.5742 3061.9839 3070.0761 3071.9793 3072.2395 3074.7558 3095.6355 3097.7020 3142.1133
redmass: 3.3442 3.8400 2.5975 2.5970 1.6152 1.7284 1.6567 2.6835 3.4432 2.2592 3.6626 3.5352 2.6296 1.1717 1.2229 3.5348 2.3874 2.7831 2.6755 3.1364 2.8321 2.5490 3.0189 3.0571 3.3661 4.0783 1.0875 1.1212 2.3620 1.8107 2.2995 1.3665 1.3898 1.8012 2.4698 2.6047 1.4326 2.0913 2.0083 3.0274 1.6552 2.0730 2.1388 2.5292 1.5513 2.1275 2.0708 2.2046 2.4905 2.0460 1.5615 1.2383 1.2122 1.4717 1.2774 1.2150 1.0729 1.1185 1.4112 1.4007 1.4603 1.4651 1.4962 1.2558 1.2139 1.2160 1.0659 1.0515 1.0935 1.1019 1.0704 1.0649 1.0688 1.0426 1.0424 1.0659 1.0810 1.0960 8.4775 7.3625 1.0643 1.0591 1.0610 1.0368 1.0366 1.0603 1.0607 1.0972 1.0371 1.0593 1.0968 1.0962 1.1002 1.0998 1.0919 1.1005 1.0996 1.0999 1.1008 1.1052 1.0964 1.1015
irintensity: 0.1423 0.3225 0.9805 0.3336 2.3865 0.4716 0.2507 1.0888 1.9257 0.0826 1.7051 1.9178 2.1246 0.3003 0.3345 0.7215 1.9052 8.3566 1.2906 4.6915 2.8765 3.9013 4.9266 4.7134 5.9677 2.7696 8.1804 10.3385 10.3329 7.1595 0.8643 26.0725 4.1412 4.7948 40.2975 77.7206 1.4711 15.1058 83.1811 0.7674 13.7578 1.9522 0.1112 2.8926 23.9265 8.8998 11.4513 0.6139 200.7218 108.9583 3.2829 11.6340 17.1181 0.6298 0.8575 0.2878 0.3552 0.7563 0.1546 0.4244 1.5410 4.3198 5.0062 56.1300 12.3103 10.2796 29.5985 14.1049 1.9521 19.9146 0.4537 3.0037 2.1378 12.6387 12.9799 10.1907 17.5557 17.4249 183.5483 4.2956 17.0053 2.1287 70.5188 34.3428 47.9883 8.3367 48.6331 3.4032 3.1763 26.5357 5.3169 5.2140 27.7427 7.3156 32.2431 91.8183 87.7840 47.1936 66.1867 16.5974 8.6144 10.9604
temp: 298.150 k
press: 1.00000 atm
elementType: 8 8 6 6 6 6 6 6 6 6 6 6 6 6 1 1 1 1 1 1 1 1 1 1 1 1 1 1 1 1 1 1 1 1 1 1
symmnumber: 1
zpe: 827282.3 jmol-1
zpe.correction: 0.315095 hartree
zpe.thermalcorrener: 0.333372 hartree
zpe.thermalcorrenthalpy: 0.334316 hartree
zpe.thermalcorrgfe: 0.264947 hartree
zpe.sumelectzpe: -619.774420 hartree
zpe.sumelectthermal: -619.756143 hartree
zpe.sumelectthermalent: -619.755199 hartree
zpe.sumelectthermalfe: -619.824569 hartree
dipole: -1.7408 -0.9435 0.3321
dipole: 2.0078
quadrupole: -91.4898 -86.3283 -84.2950
quadrupole: -6.8965 4.6274 0.2360
quadrupole: -4.1188 1.0427 3.0760 -6.8965 4.6274 0.2360
hfenergy: -620.0895155 hartree
pointgroup: C01 [X(C12H22O2)]
dipole: 0.5780531 0.5205604 0.1372231 debye
polarizability: 176.251382|17.9273356|135.5672749|-11.5312596|-2.5971551|113.9712987 unknown
InChI: InChI=1S/C12H22O2/c1-4-6-7-9-12(8-5-2)10-14-11(3)13/h9H,4-8,10H2,1-3H3
charge 0 multiplicity 1
36 atoms
O  -2.261573 0.909022 0.097382
O  -3.659168 -0.967426 0.032338
C  2.478635 0.153961 -0.696234
C  -0.091572 -0.125324 -0.551425
C  3.23079 1.326203 -0.006778
C  -0.114293 -1.32349 0.3853
C  1.037644 0.495394 -1.004838
C  -0.471948 -2.662645 -0.321147
C  4.727073 1.020485 0.230865
C  -1.436838 0.364768 -1.044247
C  -0.479841 -3.851222 0.663383
C  5.474249 2.184513 0.916971
C  -3.35166 0.14409 0.523649
C  -4.090828 0.863073 1.632842
H  2.551079 -0.751316 -0.065194
H  3.006785 -0.083967 -1.64446
H  0.862366 -1.437714 0.890725
H  -0.859573 -1.148193 1.187457
H  3.137399 2.239425 -0.630406
H  2.738345 1.556577 0.959078
H  0.909577 1.36225 -1.67486
H  -1.469972 -2.573667 -0.790662
H  0.257155 -2.848807 -1.134314
H  5.210207 0.789116 -0.740649
H  4.818583 0.104358 0.849417
H  -2.028797 -0.44122 -1.515479
H  -1.331867 1.217604 -1.733905
H  -0.727376 -4.797111 0.147919
H  -1.230955 -3.696009 1.460554
H  0.507214 -3.977292 1.148091
H  6.540521 1.941796 1.079394
H  5.026281 2.416979 1.901435
H  5.426495 3.103307 0.302358
H  -4.621565 1.739067 1.218883
H  -3.381661 1.235433 2.390375
H  -4.821811 0.18308 2.093682
