program: Gaussian 09
title: 000103991
version: EM64L-G09RevD.01
frameworkgroup: C1[X(C14H19F13O3Si)]
method: RPBEPBE
basis: SDD
operation: Freq
keyword: #p
keyword: freq=noraman
keyword: PBEPBE/SDD
title: #p freq=noraman PBEPBE/SDD
converged: NO YES NO NO
title: Mulliken charges:
elementType: Si F F F F F F F F F F F F F O O O C C C C C C C C C C C C C C H H H H H H H H H H H H H H H H H H H
charge: 1.540610 -0.162791 -0.166073 -0.130615 -0.134138 -0.127138 -0.131977 -0.120398 -0.131556 -0.114017 -0.127592 -0.124242 -0.122936 -0.122787 -0.616048 -0.592220 -0.603077 0.307892 -0.435624 0.211651 -0.907397 0.246251 0.249204 0.205872 0.371717 -0.200023 -0.201572 -0.211311 -0.658473 -0.656961 -0.656067 0.287650 0.257336 0.293222 0.278043 0.223748 0.194142 0.211634 0.195364 0.205972 0.204869 0.228928 0.224183 0.202627 0.221525 0.233847 0.202533 0.220313 0.230949 0.204948
chargesum: 0.00000
title: Mulliken charges with hydrogens summed into heavy atoms:
elementType: Si F F F F F F F F F F F F F O O O C C C C C C C C C C C C C C
charge: 1.540610 -0.162791 -0.166073 -0.130615 -0.134138 -0.127138 -0.131977 -0.120398 -0.131556 -0.114017 -0.127592 -0.124242 -0.122936 -0.122787 -0.616048 -0.592220 -0.603077 0.307892 0.109362 0.211651 -0.336131 0.246251 0.249204 0.205872 0.371717 0.217867 0.205426 0.199531 -0.002734 0.000943 0.000144
polarizability: 2.14450442e+02 -9.86136641e-01 1.83782347e+02 2.92879676e+00 -3.14819737e+00 1.77658646e+02
1716.lowfreq: -27.3206 -13.0278 -1.4007 -0.0008 -0.0008 0.0008 4.3623 6.1308 10.7046
frequency: -26.6893 -12.3222 10.2023 15.7347 21.1393 25.5706 35.7325 39.7862 42.5752 47.9106 50.8365 59.7466 66.2173 77.4698 89.1205 97.3804 107.7318 109.0720 122.0600 133.8997 145.6170 153.3562 166.4812 180.5639 196.1615 203.1373 215.1867 231.2123 239.2228 240.1911 248.7807 251.0243 255.5717 256.0676 266.3586 283.5522 285.2356 298.1576 298.8251 303.9674 304.5779 314.2866 327.4483 329.3662 336.1802 379.0243 396.7651 409.1434 416.4992 421.4138 435.3874 448.5324 463.5038 509.9226 522.6950 553.3850 563.1724 581.7530 585.9831 588.3961 654.4461 671.2757 697.3008 715.3946 761.9192 801.7451 802.8556 805.7377 806.1342 819.3671 876.3527 878.6509 933.5984 938.6246 942.4460 949.9468 974.0230 995.2479 1004.5136 1019.6761 1026.6739 1037.2637 1041.8852 1052.8463 1057.4754 1062.6879 1075.7128 1076.7038 1082.2443 1100.7611 1101.7295 1103.7959 1114.4644 1133.2179 1136.0758 1138.0963 1138.9457 1144.6951 1156.4682 1174.6149 1187.1434 1189.7172 1250.7159 1257.9794 1260.8276 1261.8008 1309.6447 1356.4158 1358.7759 1361.9633 1362.3868 1389.2612 1390.1552 1390.7390 1440.3728 1455.1046 1456.9134 1457.6185 1458.5533 1474.8370 1477.8866 1478.3075 1488.6692 1492.3634 1493.9312 2948.5875 2953.7603 2963.2259 2989.3542 2990.0594 2990.5185 3006.5034 3009.0019 3019.2180 3026.8666 3027.5096 3076.3659 3086.5644 3087.9741 3088.0886 3095.0182 3101.5131 3101.8523 3102.8710
redmass: 2.3481 3.0767 5.2018 3.2693 5.9296 5.6620 9.0513 3.1136 3.9696 7.3434 2.7184 2.3059 6.3913 7.7113 4.5591 3.5205 14.9310 7.5051 5.1476 13.3546 6.4424 5.6479 8.4913 9.4695 17.0181 2.7117 15.9400 1.5453 4.8789 1.6245 10.2167 1.2012 6.5256 2.8484 11.6045 17.1956 16.6721 3.3366 17.8720 3.7566 12.4718 14.0041 10.6316 6.1987 8.6443 6.7483 4.3052 8.8208 5.0737 8.4800 9.8727 9.4053 17.5695 12.9422 11.7031 14.3231 14.9685 7.5121 9.1636 12.3256 16.9411 3.2704 6.2561 5.5012 1.5285 1.1405 1.1332 1.9945 1.3778 12.4763 10.1958 2.7438 3.6461 3.8541 3.0992 2.6954 12.0384 6.8878 3.6407 3.7954 10.2386 12.0179 8.8090 5.3951 4.9051 5.0880 6.0493 9.0508 11.5237 2.1278 2.1660 2.1612 11.4618 9.9634 1.4872 1.4878 1.4903 9.4588 10.5840 4.1993 1.5213 11.3727 1.4083 1.1341 1.1309 1.1323 1.1519 1.2866 1.2637 1.3311 1.2442 1.2523 1.2544 1.2547 1.0713 1.0969 1.0415 1.0417 1.0466 1.0528 1.0461 1.0450 1.0769 1.0834 1.0829 1.0576 1.0558 1.0582 1.0362 1.0360 1.0361 1.1063 1.1064 1.0605 1.1035 1.0606 1.1008 1.0984 1.0988 1.0987 1.1017 1.1014 1.1017 1.1013
irintensity: 0.1288 0.3240 0.0270 0.2607 0.1514 0.0808 0.0729 0.1342 0.3462 0.1737 0.3376 1.9985 0.1768 1.2314 7.8687 2.5922 0.4038 2.4344 6.8524 1.1550 1.1587 1.0684 6.8438 6.7315 11.2128 1.5733 8.0396 4.4064 0.7350 1.6268 0.4945 1.0537 5.8042 8.7076 1.0699 1.1408 1.3121 15.9945 0.1348 15.3849 1.1605 1.3708 0.3466 1.9359 0.3864 7.0159 9.7736 11.4404 7.3122 6.1638 35.8399 32.5582 7.7376 2.4983 2.6070 5.7250 8.2275 4.6777 5.2276 4.3061 42.8289 34.7952 42.5531 29.6411 27.0182 6.6432 1.9509 42.6108 31.3184 227.1322 48.9194 84.7957 15.8006 208.6652 153.6291 102.3502 16.8376 26.3619 117.7572 53.3585 81.8304 95.8840 29.1929 83.3192 342.7681 193.9322 165.9777 236.5830 406.7459 5.8690 4.4601 37.7656 13.2868 71.8240 10.5164 6.8438 7.8202 17.7452 4.5585 20.7307 30.4467 50.5993 75.2025 1.3062 3.2171 0.9769 2.1901 2.1631 17.3022 7.0004 13.1299 25.4839 45.6801 13.3846 5.5086 27.4853 11.5811 9.9109 11.8724 3.9633 7.0846 4.8439 9.6371 3.8812 0.5864 41.8976 49.7278 68.3073 26.8763 22.3495 24.5836 52.7848 20.6966 2.2483 19.4023 18.1352 0.5423 32.5302 18.3124 61.3118 2.3950 24.3735 53.2793 38.7377
temp: 298.150 k
press: 1.00000 atm
elementType: 14 9 9 9 9 9 9 9 9 9 9 9 9 9 8 8 8 6 6 6 6 6 6 6 6 6 6 6 6 6 6 1 1 1 1 1 1 1 1 1 1 1 1 1 1 1 1 1 1 1
symmnumber: 1
zpe: 872860.3 jmol-1
zpe.correction: 0.332455 hartree
zpe.thermalcorrener: 0.367755 hartree
zpe.thermalcorrenthalpy: 0.368699 hartree
zpe.thermalcorrgfe: 0.260390 hartree
zpe.sumelectzpe: -2355.462972 hartree
zpe.sumelectthermal: -2355.427672 hartree
zpe.sumelectthermalent: -2355.426728 hartree
zpe.sumelectthermalfe: -2355.535037 hartree
dipole: -4.9550 2.1230 1.7053
dipole: 5.6539
quadrupole: -166.8105 -187.1329 -192.0452
quadrupole: -4.3516 -3.3419 -3.7120
quadrupole: 15.1856 -5.1367 -10.0490 -4.3516 -3.3419 -3.7120
hfenergy: -2355.7954271 hartree
pointgroup: C01 [X(C14H19F13O3Si1)]
dipole: -1.9386125 -0.8340563 -0.7029903 debye
polarizability: 214.103733|2.4473661|184.5584217|-3.7914168|-2.5782141|177.2292801 unknown
InChI: InChI=1S/C14H19F13O3Si/c1-4-28-31(29-5-2,30-6-3)8-7-9(15,16)10(17,18)11(19,20)12(21,22)13(23,24)14(25,26)27/h4-8H2,1-3H3
charge 0 multiplicity 1
50 atoms
Si -3.759144 -0.066333 0.423571
F  -0.027665 1.776626 2.557935
F  0.679135 -0.301923 1.93699
F  2.537045 1.694974 1.611764
F  1.074644 2.965876 0.398407
F  3.067048 1.887056 -1.068666
F  0.968948 1.16481 -1.615358
F  2.875852 -0.614215 -2.139967
F  1.44039 -1.304305 -0.509259
F  3.400145 -0.982449 1.439395
F  3.950938 -2.304176 -0.338106
F  5.495038 -0.050377 -1.399138
F  6.122975 -1.029712 0.547338
F  5.131745 1.003844 0.581388
O  -4.008117 1.358137 -0.491461
O  -5.005558 -0.470346 1.535313
O  -3.593189 -1.309347 -0.765526
C  0.220867 0.9536 1.412932
C  -1.050137 0.776528 0.59638
C  1.452004 1.628953 0.705633
C  -2.213452 0.237855 1.462482
C  2.006284 1.0450 -0.651253
C  2.529295 -0.43808 -0.777477
C  3.750526 -0.964058 0.075414
C  5.142075 -0.237378 -0.058934
C  -4.783477 1.501301 -1.735505
C  -6.431699 -0.669155 1.230462
C  -3.569478 -2.760889 -0.529851
C  -4.335971 2.788782 -2.427165
C  -7.076228 -1.385585 2.417021
C  -3.825323 -3.463646 -1.863707
H  -1.328223 1.749721 0.153445
H  -0.83814 0.085616 -0.239252
H  -2.469233 0.95763 2.259447
H  -1.92477 -0.70574 1.961104
H  -4.61204 0.616272 -2.378978
H  -5.862149 1.550196 -1.480999
H  -6.902619 0.32112 1.067332
H  -6.544002 -1.264526 0.299465
H  -2.578003 -3.046784 -0.122642
H  -4.340096 -3.036952 0.219474
H  -4.485252 3.655626 -1.760681
H  -3.2661 2.734036 -2.692951
H  -4.91997 2.951213 -3.352497
H  -6.610811 -2.374002 2.574371
H  -6.943971 -0.791308 3.33713
H  -8.159008 -1.527859 2.241592
H  -4.817798 -3.190286 -2.262022
H  -3.061714 -3.168431 -2.603606
H  -3.785317 -4.56161 -1.736186
