program: Gaussian 09
title: 000103803
version: EM64L-G09RevD.01
frameworkgroup: C1[X(C12H26O3)]
method: RPBEPBE
basis: SDD
operation: Freq
keyword: #pfreq=noraman
keyword: PBEPBE/SDD
title: #p freq=noraman PBEPBE/SDD
converged: YES YES NO NO
title: Mulliken charges:
elementType: O O O C C C C C C C C C C C C H H H H H H H H H H H H H H H H H H H H H H H H H H
charge: -0.275971 -0.272180 -0.266480 -0.022675 -0.426155 -0.406162 -0.363304 -0.323925 -0.354735 -0.723674 -0.249819 -0.697923 -0.008682 -0.506683 -0.528615 0.208528 0.182765 0.196100 0.236175 0.200363 0.202801 0.189583 0.188742 0.185637 0.193101 0.194332 0.215388 0.215697 0.218982 0.204822 0.189042 0.215252 0.210408 0.210152 0.224827 0.230218 0.212664 0.227924 0.230333 0.208261 0.234886
chargesum: 0.00000
title: Mulliken charges with hydrogens summed into heavy atoms:
elementType: O O O C C C C C C C C C C C C
charge: -0.275971 -0.272180 -0.266480 0.185853 -0.047289 0.030376 0.029080 0.050454 0.032698 -0.073607 0.144045 -0.062112 0.216144 0.164123 0.144865
polarizability: 1.76565479e+02 9.85263537e-02 1.34966962e+02 3.42767728e+00 -2.84632456e+00 1.18114784e+02
1716.lowfreq: -17.4816 -6.1331 -0.0009 -0.0007 -0.0005 3.2335 13.5615 21.9843 38.7668
frequency: 12.0705 20.7800 38.7404 56.6367 57.3619 74.7133 84.3442 101.5950 112.9243 123.4649 130.2051 150.7350 158.0946 180.4672 202.3749 223.3321 227.6657 247.0940 266.4039 270.8419 303.2241 309.8426 336.6565 392.7196 453.1871 500.2215 537.6889 551.8662 612.3852 726.4561 759.7895 780.8392 800.2812 807.4632 848.1419 889.5049 912.8586 927.6311 970.7912 980.6230 987.9998 998.1630 1012.3934 1026.3943 1038.5186 1055.6873 1058.3544 1080.1091 1092.5878 1103.2404 1112.1118 1117.3932 1130.5021 1152.1062 1154.9580 1158.7286 1166.1752 1198.1690 1211.4024 1216.2669 1247.8549 1268.6209 1279.9958 1286.1562 1294.3664 1307.6523 1328.1861 1332.2085 1342.4385 1353.1489 1358.4143 1360.5329 1389.6919 1392.8309 1402.4931 1423.4102 1432.2285 1454.9595 1456.7451 1462.0789 1465.3388 1468.2739 1473.4474 1475.2060 1475.6776 1476.4485 1481.5629 1483.7876 1485.2891 1491.0647 1493.0420 2910.0378 2932.5521 2951.2570 2953.2982 2955.9180 2957.1185 2957.7132 2967.4763 2970.8531 2971.9159 2978.6588 2988.9845 2990.5729 2997.3544 3008.9228 3019.7756 3034.4212 3042.4244 3046.3343 3048.9974 3068.3866 3070.4099 3070.5491 3075.1495 3110.3997 3113.5870
redmass: 3.3500 3.8064 3.2865 2.0772 2.2119 2.8637 2.4205 2.8702 2.0934 2.0034 1.9140 1.7448 1.6324 1.7002 2.7199 1.1523 2.6975 1.4420 2.4943 2.7555 3.4010 2.1442 3.4673 4.0536 3.0391 2.6617 2.4851 3.0639 4.1863 1.0929 1.4510 1.5431 2.7218 1.4289 5.5816 1.8094 1.2950 5.2623 1.6753 2.0902 2.0440 6.9547 3.2734 1.3730 2.6511 2.4663 6.0220 2.5020 2.1515 2.1844 1.2683 1.3914 1.7306 1.4338 2.0709 1.5928 2.1246 1.2114 1.4068 1.2004 1.2631 1.2148 1.1483 1.0698 1.2328 1.2559 1.4547 1.1535 1.4811 1.4281 1.4377 1.4855 1.2181 1.2303 1.5045 1.1277 1.1501 1.0748 1.0562 1.0680 1.0729 1.0589 1.0656 1.0625 1.0564 1.0425 1.0521 1.0688 1.0683 1.0782 1.0556 1.0546 1.0543 1.0901 1.0639 1.0342 1.0343 1.0602 1.0600 1.0894 1.0363 1.0362 1.1038 1.0797 1.0826 1.1000 1.0874 1.1038 1.0984 1.1010 1.1007 1.1006 1.0992 1.0986 1.1003 1.1008 1.1007
irintensity: 0.0466 0.1113 0.1970 0.1181 0.0250 0.2987 3.8089 2.1489 1.9895 1.1991 0.9382 5.6518 1.2574 1.2994 0.8880 0.8873 15.7504 0.4358 0.5090 6.4665 9.0350 0.5480 3.1934 2.4913 0.4358 3.6074 1.5081 12.2067 1.8517 8.9238 7.3257 13.9776 48.6896 6.8594 17.2261 8.4436 2.9484 28.0853 2.1743 4.9664 13.5933 120.9640 92.1367 5.6797 8.2370 31.4689 181.0709 19.9040 31.9534 28.8119 0.2868 5.3413 0.5291 5.7475 0.6740 3.9202 3.8908 0.5585 0.0788 10.5876 2.5615 1.2887 3.5179 1.4711 4.1050 5.7522 0.3888 13.2747 4.1493 0.8942 0.2614 0.6834 11.7521 19.4345 6.7788 3.6852 7.5590 6.0536 13.1286 0.9075 0.6396 1.4986 5.3107 2.1659 23.5583 11.8391 12.6453 17.1468 6.8459 4.9715 11.1931 45.3884 61.7347 9.9604 17.0139 117.0375 15.9115 9.1849 94.8577 42.5750 37.1204 32.5612 28.1586 11.6370 40.9357 16.7118 49.1525 87.8233 3.4370 26.1081 70.3928 89.5508 34.2700 69.0520 71.5046 30.0308 24.6037
temp: 298.150 k
press: 1.00000 atm
elementType: 8 8 8 6 6 6 6 6 6 6 6 6 6 6 6 1 1 1 1 1 1 1 1 1 1 1 1 1 1 1 1 1 1 1 1 1 1 1 1 1 1
symmnumber: 1
zpe: 956112.3 jmol-1
zpe.correction: 0.364164 hartree
zpe.thermalcorrener: 0.384574 hartree
zpe.thermalcorrenthalpy: 0.385518 hartree
zpe.thermalcorrgfe: 0.311960 hartree
zpe.sumelectzpe: -697.216425 hartree
zpe.sumelectthermal: -697.196016 hartree
zpe.sumelectthermalent: -697.195072 hartree
zpe.sumelectthermalfe: -697.268630 hartree
dipole: 0.0475 -0.5043 1.1013
dipole: 1.2122
quadrupole: -90.0134 -92.7326 -95.0534
quadrupole: 2.9680 3.7729 -4.8592
quadrupole: 2.5864 -0.1328 -2.4536 2.9680 3.7729 -4.8592
hfenergy: -697.5805894 hartree
pointgroup: C01 [X(C12H26O3)]
dipole: 0.0191535 -0.1900595 0.4370028 debye
polarizability: 176.5656656|0.2512261|134.8529138|3.422792|-3.1590664|118.2286463 unknown
InChI: InChI=1S/C12H26O3/c1-5-7-8-11(6-2)9-15-10-12(13-3)14-4/h11-12H,5-10H2,1-4H3
charge 0 multiplicity 1
41 atoms
O  0.902331 -0.279947 -0.315203
O  3.580509 1.041187 0.093769
O  4.485686 -1.117671 -0.507478
C  -1.523652 -0.037014 -0.271415
C  -2.836912 -0.658967 0.277604
C  -1.437106 1.508584 -0.116393
C  -4.125464 -0.096745 -0.364072
C  -0.313814 -0.740654 0.368882
C  -5.402456 -0.82164 0.119755
C  -1.613261 2.042245 1.324254
C  2.116619 -0.850949 0.26293
C  -6.693253 -0.251949 -0.507368
C  3.302131 -0.252692 -0.501543
C  4.449095 1.88533 -0.740184
C  5.013761 -1.430443 0.831298
H  -1.47379 -0.256669 -1.359344
H  -2.808707 -1.756381 0.107331
H  -2.888264 -0.520798 1.377648
H  -0.451824 1.827904 -0.503964
H  -2.200889 1.974749 -0.769115
H  -4.219009 0.984814 -0.139274
H  -4.053433 -0.180734 -1.468909
H  -0.408394 -1.845429 0.259844
H  -0.245728 -0.508978 1.455986
H  -5.320453 -1.90235 -0.117045
H  -5.464378 -0.750338 1.225185
H  -1.528681 3.144383 1.338891
H  -2.601861 1.7783 1.7438
H  -0.837728 1.646627 2.005786
H  2.193341 -0.603104 1.3435
H  2.121534 -1.95643 0.138673
H  -7.590692 -0.787011 -0.145754
H  -6.669542 -0.338425 -1.610184
H  -6.815415 0.819262 -0.258701
H  3.051956 -0.156972 -1.576145
H  4.600964 2.815766 -0.171718
H  3.958567 2.116036 -1.707487
H  5.42138 1.393266 -0.931419
H  5.996969 -1.895532 0.660048
H  4.361997 -2.148391 1.368796
H  5.129967 -0.51204 1.436636
