program: Gaussian 09
title: 000104005
version: EM64L-G09RevD.01
frameworkgroup: C1[X(C23H21BrN6O5)]
method: RPBEPBE
basis: SDD
operation: Freq
keyword: #p
keyword: freq=noraman
keyword: PBEPBE/SDD
title: #p freq=noraman PBEPBE/SDD
converged: YES YES NO NO
title: Mulliken charges:
elementType: Br O O O O O N N N N N N C C C C C C C C C C C C C C C C C C C C C C C H H H H H H H H H H H H H H H H H H H H H
charge: 0.062995 -0.268513 -0.220874 -0.166641 -0.206985 -0.206149 -0.165148 -0.439932 -0.124569 -0.096965 -0.000370 0.016130 -0.573442 0.543134 -0.393095 0.462791 -0.517524 -0.355614 0.331485 -0.659181 -0.037957 -0.281018 -0.370570 -0.415881 -0.231401 -0.216331 -0.236867 0.222532 0.219443 0.409398 -0.355609 -0.796655 -0.504778 0.442260 -0.373832 0.245351 0.251049 0.242996 0.250871 0.325827 0.247260 0.232019 0.209541 0.252470 0.281576 0.254228 0.232198 0.376846 0.234483 0.232170 0.235697 0.255623 0.271832 0.248923 0.315197 0.309575
chargesum: 0.00000
title: Mulliken charges with hydrogens summed into heavy atoms:
elementType: Br O O O O O N N N N N N C C C C C C C C C C C C C C C C C C C C C C C
charge: 0.062995 -0.268513 -0.220874 -0.166641 -0.206985 -0.206149 -0.165148 -0.063087 -0.124569 -0.096965 -0.000370 0.016130 -0.077042 0.543134 0.100772 0.462791 -0.191697 -0.108353 0.331485 0.034849 -0.037957 0.000558 -0.116342 -0.183684 0.003082 0.015839 -0.001171 0.222532 0.219443 0.409398 -0.355609 -0.020276 -0.189581 0.442260 -0.064257
polarizability: 9.12047050e+02 -9.90562042e+00 3.66334334e+02 5.08899355e+01 1.53660827e+01 2.25544987e+02
1716.lowfreq: -4.5210 -3.4569 -0.0009 -0.0007 -0.0002 2.2904 10.1599 12.5465 18.7536
frequency: 9.5324 12.3794 18.7482 25.9091 27.1394 34.4555 53.8451 58.6308 63.9913 74.5414 82.2161 84.4831 92.0580 97.5972 101.7453 108.2131 115.5248 134.5896 143.8210 163.1542 176.9509 179.5378 187.7626 200.2285 201.5968 240.8671 256.5200 261.7315 272.3664 285.1061 296.6236 309.2299 323.4538 346.4243 361.9713 376.7731 402.5436 413.1542 419.1333 427.4454 456.7755 474.2803 495.7953 511.7208 515.8840 529.1049 531.4513 557.8019 570.5383 580.7855 603.5431 614.1047 616.7193 638.2795 647.7561 661.4898 680.0392 691.3858 699.3752 703.4751 715.6611 740.3870 745.3833 761.7183 786.3303 790.4490 798.7820 807.2528 813.0306 835.0989 854.5592 856.0383 865.4446 903.6749 910.1015 911.8411 924.9533 930.4818 932.2071 941.9182 978.4980 980.4948 989.4496 990.2939 1001.0152 1005.7800 1016.5272 1027.6076 1046.0680 1057.9580 1076.1313 1087.6225 1113.4156 1117.6904 1123.8380 1174.1404 1175.0054 1182.9184 1189.3669 1192.9053 1198.1994 1199.8419 1214.1807 1222.9284 1231.2793 1242.9397 1270.9088 1291.0177 1301.8007 1306.1072 1332.6384 1342.0763 1345.7165 1349.4507 1358.3311 1373.7499 1377.6898 1382.9927 1391.6360 1393.3196 1394.6298 1418.3811 1420.8622 1440.5953 1451.9415 1466.0906 1471.6690 1474.1339 1475.5192 1481.6764 1489.5028 1502.8530 1506.6547 1525.6134 1536.1567 1546.8062 1583.3504 1595.1488 1613.6655 1617.8504 1627.1148 2990.6967 2991.4012 2995.6049 3014.6201 3047.1892 3067.0924 3087.7661 3088.7237 3103.1325 3114.6398 3126.1856 3130.4852 3141.1871 3151.9004 3158.1070 3167.9007 3177.6299 3182.7661 3190.6682 3202.2074 3424.2789
redmass: 5.2907 9.7638 5.6971 5.0527 7.0421 7.5097 6.1004 14.4555 6.7125 2.7927 3.8561 3.9991 1.7116 5.3903 7.9642 4.5181 5.2322 5.1274 11.6836 7.5139 5.4372 5.8168 5.0778 3.4143 1.4118 2.6607 5.1474 13.9409 6.7643 3.9752 8.1505 8.0790 8.5014 4.5928 4.8628 5.3674 2.8326 5.0714 3.4355 5.4578 2.9754 3.9656 3.5869 5.3659 6.1103 3.9585 3.9630 5.4860 6.5717 3.1727 7.5317 5.5744 5.8044 7.0959 3.9904 5.9099 9.5284 7.4660 6.9601 2.3998 4.2854 1.6521 3.8986 5.8851 6.9828 3.7549 1.5344 3.0403 1.8739 1.1725 1.5749 1.9494 6.2067 8.6369 1.4225 1.4710 1.3727 4.4473 1.4826 2.8321 1.3560 1.3509 4.2051 2.3545 1.4333 1.8795 1.9006 2.1768 1.6527 2.2464 2.1060 1.5828 2.0148 2.5687 5.0355 1.8565 1.0715 1.6728 1.1630 2.2922 2.6207 5.0752 3.1914 3.4363 2.4642 1.8709 1.3024 2.6123 1.6005 1.6196 3.8735 1.3586 1.5659 3.1836 10.4687 7.6825 4.1575 3.8263 2.5916 1.2566 1.2560 5.8979 4.6327 2.1534 1.3747 1.5164 1.2275 1.0845 1.1565 1.5800 1.2952 1.4247 3.2561 2.8633 3.6266 8.6627 7.7920 6.0425 5.9034 4.7259 6.9968 1.0500 1.0497 1.0382 1.0617 1.0972 1.1016 1.0960 1.1002 1.1012 1.0883 1.1009 1.0859 1.0910 1.0958 1.0870 1.1015 1.0969 1.0931 1.0929 1.0918 1.0772
irintensity: 0.1959 0.0318 0.0728 0.0624 0.0108 0.0032 0.3210 0.2018 2.0793 4.6783 2.3990 0.6209 1.7862 0.7231 1.0072 2.4074 3.5782 0.9148 3.2366 4.0826 1.6785 0.6929 6.1379 3.9748 1.4692 0.4195 3.4630 0.1334 1.8835 1.3721 17.1603 0.7885 2.8452 2.9061 0.6095 0.4309 0.6014 7.3122 3.0234 12.6709 7.2249 7.7792 6.7936 19.1126 4.1547 10.2670 1.5325 8.8858 7.6628 0.8428 6.6777 9.4881 8.4491 20.6793 5.9825 1.2018 38.8982 7.0414 8.9327 25.3188 26.8609 48.2955 3.8614 18.8632 16.5925 20.0370 20.1963 15.3478 29.8006 48.9628 6.3930 9.8180 60.2247 27.5192 35.3310 0.2009 1.7636 12.3994 32.8963 3.0316 2.1075 0.5732 10.6477 67.3341 15.2197 13.7689 25.8894 15.8016 13.6400 80.8111 69.1264 4.0135 35.8251 28.9976 33.7996 26.4717 1.0755 137.8425 202.1614 416.0264 12.1571 1634.3749 121.3711 271.6717 212.1244 167.2594 44.4181 378.4506 16.3797 47.2768 621.6298 12.8983 127.8697 137.1204 109.6442 130.5596 309.0550 108.0460 81.3456 20.9774 24.5195 32.3872 9.6540 35.0313 204.5751 133.9782 65.9162 20.1324 24.9934 23.7509 10.3056 37.7856 56.2528 98.3921 335.9331 71.5765 258.8891 0.8353 32.5844 24.3289 822.7932 3.1352 74.4017 5.1643 52.4307 4.5348 0.9220 5.4124 28.8373 40.9502 9.2954 4.4296 2.7440 10.0036 41.0053 2.0455 26.5816 16.4407 10.8316 9.9996 12.1504 53.5195
temp: 298.150 k
press: 1.00000 atm
elementType: 35 8 8 8 8 8 7 7 7 7 7 7 6 6 6 6 6 6 6 6 6 6 6 6 6 6 6 6 6 6 6 6 6 6 6 1 1 1 1 1 1 1 1 1 1 1 1 1 1 1 1 1 1 1 1 1
symmnumber: 1
zpe: 1081995.6 jmol-1
zpe.correction: 0.412110 hartree
zpe.thermalcorrener: 0.445074 hartree
zpe.thermalcorrenthalpy: 0.446018 hartree
zpe.thermalcorrgfe: 0.341576 hartree
zpe.sumelectzpe: -1604.453093 hartree
zpe.sumelectthermal: -1604.420130 hartree
zpe.sumelectthermalent: -1604.419185 hartree
zpe.sumelectthermalfe: -1604.523627 hartree
dipole: -12.0421 -2.1256 -2.3390
dipole: 12.4499
quadrupole: -221.7177 -215.3305 -210.1195
quadrupole: 12.2732 -1.5721 -4.2073
quadrupole: -5.9951 0.3921 5.6030 12.2732 -1.5721 -4.2073
hfenergy: -1604.8652034 hartree
pointgroup: C01 [X(C23H21Br1N6O5)]
dipole: 4.7292432 -0.9532547 -0.8471745 debye
polarizability: 913.1349194|-43.8749566|228.6100122|3.0451252|28.5251719|362.1814393 unknown
InChI: InChI=1S/C23H21BrN6O5/c1-3-28(14-16-7-5-4-6-8-16)17-9-10-20(21(12-17)25-15(2)31)26-27-23-19(24)11-18(29(32)33)13-22(23)30(34)35/h4-13,25H,3,14H2,1-2H3
charge 0 multiplicity 1
56 atoms
Br -3.729855 -1.730046 -3.258268
O  1.682228 -0.288634 4.124774
O  -3.169952 0.770323 2.568768
O  -2.431822 2.183704 0.929887
O  -8.104982 0.974312 0.764913
O  -8.467671 -0.13593 -1.201393
N  4.248315 -0.901517 0.084347
N  0.00321 -0.299819 2.483974
N  -1.350941 -0.409137 0.172865
N  -2.07314 -0.514563 -0.938991
N  -3.113146 1.171121 1.336861
N  -7.690118 0.341642 -0.284823
C  5.027003 -1.298532 -1.107628
C  2.868095 -0.790105 0.079561
C  5.050605 -0.693325 1.318222
C  5.709516 -0.138078 -1.838455
C  2.156748 -0.610311 1.308365
C  2.122436 -0.83263 -1.163556
C  0.758665 -0.48218 1.315191
C  5.209312 -1.974504 2.166486
C  0.016418 -0.53976 0.066362
C  0.741654 -0.710384 -1.157341
C  5.131705 1.15493 -1.877708
C  6.929916 -0.369093 -2.521444
C  5.760951 2.196623 -2.596401
C  7.557001 0.670149 -3.244099
C  6.97282 1.957424 -3.284246
C  0.458277 -0.196883 3.806845
C  -3.431341 -0.243439 -0.750528
C  -3.992038 0.490163 0.354507
C  -4.373785 -0.723835 -1.719376
C  -0.646965 0.007703 4.832529
C  -5.366672 0.668024 0.536992
C  -6.237203 0.151538 -0.444205
C  -5.753731 -0.535296 -1.582273
H  5.798632 -2.0217 -0.779148
H  4.371842 -1.856316 -1.799593
H  6.04156 -0.324692 0.996655
H  4.592553 0.112022 1.917154
H  2.664642 -0.582008 2.271243
H  2.642847 -0.920173 -2.120495
H  5.845278 -1.764948 3.044975
H  5.687071 -2.78365 1.584709
H  4.234152 -2.338838 2.530725
H  0.16758 -0.729915 -2.08854
H  4.197734 1.352433 -1.340102
H  7.39262 -1.363944 -2.488708
H  -1.009357 -0.210791 2.318328
H  5.305624 3.192834 -2.618614
H  8.500283 0.478913 -3.767516
H  7.45953 2.76584 -3.840602
H  -0.252073 0.613504 5.6626
H  -1.539722 0.494258 4.40572
H  -0.949349 -0.971789 5.248214
H  -5.769823 1.20924 1.39693
H  -6.464436 -0.915441 -2.319449
