program: Gaussian 09
title: 000103857
version: EM64L-G09RevD.01
frameworkgroup: C1[X(C14H20O9)]
method: RPBEPBE
basis: SDD
operation: Freq
keyword: #pfreq=noraman
keyword: PBEPBE/SDD
title: #p freq=noraman PBEPBE/SDD
converged: YES YES NO NO
title: Mulliken charges:
elementType: O O O O O O O O O C C C C C C C C C C C C C C H H H H H H H H H H H H H H H H H H H H
charge: -0.246456 -0.271865 -0.270113 -0.262214 -0.255821 -0.244077 -0.239800 -0.252863 -0.250507 -0.060257 -0.179191 -0.132087 -0.060311 -0.303182 -0.400099 0.301707 0.301009 0.324024 -0.755203 -0.754904 0.322822 -0.769641 -0.751071 0.266189 0.322617 0.293635 0.286957 0.237510 0.225130 0.271181 0.282236 0.250912 0.252732 0.258757 0.252400 0.249797 0.252053 0.271410 0.241545 0.247258 0.250686 0.246666 0.250428
chargesum: 0.00000
title: Mulliken charges with hydrogens summed into heavy atoms:
elementType: O O O O O O O O O C C C C C C C C C C C C C C
charge: -0.246456 -0.271865 -0.270113 -0.262214 -0.255821 -0.244077 -0.239800 -0.252863 -0.250507 0.205933 0.143426 0.161548 0.226646 0.159458 0.153318 0.301707 0.301009 0.324024 0.007198 -0.000654 0.322822 -0.009429 -0.003291
polarizability: 1.94641250e+02 2.99249159e+00 1.85662744e+02 2.70969509e+00 5.53387600e+00 1.54689600e+02
1716.lowfreq: -6.1633 -1.3455 -0.0012 -0.0010 -0.0008 2.3139 17.7275 22.7616 29.9908
frequency: 17.6834 22.7198 29.9473 30.7016 33.2340 37.9318 47.5920 49.3252 54.1893 60.1596 67.9717 71.2778 83.2385 86.7884 102.3017 108.2948 133.1538 138.7675 164.9477 189.3669 207.7088 217.7627 257.0596 267.4054 271.9756 339.6332 353.1577 366.1466 398.0615 418.5053 434.3526 488.2678 522.6707 550.3526 561.8287 563.2731 564.8179 596.9253 599.1803 616.0327 631.0964 647.4831 716.5441 753.5053 765.2255 797.5972 823.4706 841.7522 871.9685 880.6218 893.7696 909.8297 925.8394 955.4134 986.3101 991.9898 994.5781 997.3430 1000.4787 1023.4119 1033.4238 1042.0064 1042.5194 1043.2512 1044.2341 1046.9564 1055.9797 1079.5915 1144.4853 1168.5323 1185.9725 1187.3648 1195.9715 1210.0899 1231.4668 1233.4340 1260.6307 1274.9884 1277.8857 1306.7364 1308.8868 1326.9086 1337.8358 1360.4323 1375.5172 1381.8528 1383.9316 1385.1814 1387.7521 1451.3743 1451.7445 1453.1988 1453.3797 1453.4336 1453.9845 1455.3060 1456.1985 1461.3121 1468.3135 1654.3329 1654.9895 1658.7988 1660.1767 3003.7747 3004.0466 3007.2303 3009.1546 3009.2860 3013.2347 3038.5363 3051.7722 3078.0633 3084.8838 3091.0362 3096.3085 3097.1951 3098.8715 3099.2482 3112.0235 3141.9219 3143.4984 3145.4098 3145.9392
redmass: 6.4028 3.9836 1.3976 1.8401 1.5289 1.5497 6.6328 6.1706 3.1889 2.9782 2.6281 4.4149 4.3316 3.7651 4.0115 1.1210 3.1923 5.6732 6.0420 8.4465 7.1672 4.5512 6.3782 6.0246 5.0068 3.9895 2.9443 3.4427 3.5552 3.5269 3.2644 3.4357 4.0619 3.1796 3.2407 3.2347 3.2012 5.3671 4.5339 4.5061 4.7047 4.4685 5.9405 5.6526 4.4095 4.2639 4.1848 4.7294 4.0171 4.7434 4.6682 4.2158 4.2258 3.7116 2.4812 1.8768 1.9816 1.8516 2.5734 2.7357 2.5308 2.1032 1.6933 1.6797 2.2050 1.6773 3.4272 1.9339 1.3594 1.7624 3.1077 3.1230 3.3501 2.9839 1.6489 1.4513 1.1884 1.3331 1.2494 1.3890 1.3990 1.2751 1.4521 1.4512 1.4256 1.2691 1.3105 1.2464 1.2426 1.0616 1.0609 1.0587 1.0506 1.0504 1.0465 1.0518 1.0576 1.0875 1.0846 9.4909 9.7336 9.4893 9.0484 1.0819 1.0381 1.0377 1.0371 1.0369 1.0610 1.0605 1.0814 1.0997 1.0929 1.0887 1.0972 1.0973 1.0956 1.0947 1.1077 1.1021 1.1016 1.1010 1.1010
irintensity: 0.6929 0.2015 1.4080 2.0819 1.1981 2.6838 0.3562 0.8066 0.8510 1.4181 2.8332 1.6510 6.7293 2.6845 9.6365 0.3614 0.6933 1.3006 6.3751 1.6304 6.9834 4.7164 4.2628 8.9325 9.6654 11.6210 6.7100 6.5337 10.8490 14.5134 9.9798 8.6864 12.9998 2.3124 2.9165 2.8834 3.0657 3.7383 5.2617 4.2831 13.9829 18.1177 6.8763 8.6347 25.4809 20.2394 13.8847 14.8876 14.0025 14.9699 32.0892 75.7742 79.3677 78.0374 21.2520 83.8494 117.5685 32.3547 76.5281 54.7474 33.8629 9.7254 16.3666 15.3507 26.0426 16.6341 89.4208 30.4041 26.1975 40.0936 369.3826 324.0985 375.2262 149.6229 7.6021 73.4416 13.8136 2.3854 13.5833 3.8930 4.9045 2.8794 4.1869 2.5450 12.7600 49.8296 49.0847 86.5734 37.5852 27.4334 42.5771 4.2721 25.8666 19.3196 21.1141 23.6259 22.3799 18.5506 6.4343 285.5893 216.8867 66.9086 144.1850 21.9533 1.5473 1.6124 0.8208 1.2438 34.9830 4.3113 12.5018 6.1924 32.5646 1.8375 4.6034 5.6620 8.5695 5.4036 0.8989 9.8624 9.5255 9.5974 7.5634
temp: 298.150 k
press: 1.00000 atm
elementType: 8 8 8 8 8 8 8 8 8 6 6 6 6 6 6 6 6 6 6 6 6 6 6 1 1 1 1 1 1 1 1 1 1 1 1 1 1 1 1 1 1 1 1
symmnumber: 1
zpe: 870311.6 jmol-1
zpe.correction: 0.331484 hartree
zpe.thermalcorrener: 0.357997 hartree
zpe.thermalcorrenthalpy: 0.358942 hartree
zpe.thermalcorrgfe: 0.268227 hartree
zpe.sumelectzpe: -1220.728172 hartree
zpe.sumelectthermal: -1220.701659 hartree
zpe.sumelectthermalent: -1220.700715 hartree
zpe.sumelectthermalfe: -1220.791429 hartree
dipole: -2.3986 -1.8656 -1.3521
dipole: 3.3259
quadrupole: -150.4716 -111.9371 -140.0713
quadrupole: -5.8255 2.7110 4.0183
quadrupole: -16.3116 22.2229 -5.9113 -5.8255 2.7110 4.0183
hfenergy: -1221.0596563 hartree
pointgroup: C01 [X(C14H20O9)]
dipole: -0.9951073 -0.7411991 0.4154788 debye
polarizability: 194.3061834|-0.7580046|169.1989015|-5.4007247|-16.2423951|171.4885082 unknown
InChI: InChI=1S/C14H20O9/c1-7(15)19-5-11(21-8(2)16)13-14(23-10(4)18)12(6-20-13)22-9(3)17/h11-14H,5-6H2,1-4H3
charge 0 multiplicity 1
43 atoms
O  -0.279084 1.551698 1.323022
O  -1.183262 1.285593 -1.544114
O  -2.790032 -0.393799 1.304383
O  2.317642 0.529103 0.827461
O  1.533077 -1.976435 -0.43281
O  -1.324877 -0.391778 -3.168307
O  -4.774896 0.687453 1.878799
O  3.666362 1.810428 -0.581554
O  3.857374 -1.991943 -0.148925
C  -0.058273 0.354968 0.474384
C  -1.292141 0.279014 -0.4487
C  -2.418652 0.78546 0.470595
C  1.286504 0.486685 -0.242764
C  -1.727955 1.874236 1.314307
C  1.612318 -0.690479 -1.177654
C  -1.250837 0.820521 -2.874537
C  -4.027902 -0.309963 1.971492
C  3.508597 1.203163 0.50063
C  -1.205559 1.987713 -3.830586
C  -4.278921 -1.567893 2.768946
C  2.739009 -2.510759 0.054837
C  4.520525 1.040457 1.606279
C  2.461267 -3.771282 0.842568
H  -0.05846 -0.550332 1.113278
H  -1.478401 -0.721127 -0.871025
H  -3.308086 1.148938 -0.067793
H  1.32779 1.428729 -0.818831
H  -2.104116 1.895732 2.351058
H  -1.862441 2.867818 0.848789
H  0.872815 -0.78839 -1.98805
H  2.62647 -0.566332 -1.593753
H  -1.222649 1.620365 -4.866297
H  -2.068232 2.654117 -3.657339
H  -0.293305 2.584892 -3.658933
H  -4.271586 -2.4483 2.103452
H  -5.249796 -1.495091 3.279044
H  -3.476178 -1.712542 3.51262
H  4.982216 0.040743 1.505082
H  5.302979 1.807966 1.515087
H  4.036122 1.094592 2.594079
H  1.73269 -4.407545 0.314625
H  3.399855 -4.319569 1.008111
H  2.023327 -3.503625 1.821248
