program: Gaussian 09
title: 000103814
version: EM64L-G09RevD.01
frameworkgroup: C1[X(C15H24O)]
method: RPBEPBE
basis: SDD
operation: Freq
keyword: #pfreq=noraman
keyword: PBEPBE/SDD
title: #p freq=noraman PBEPBE/SDD
converged: NO YES NO NO
title: Mulliken charges:
elementType: O C C C C C C C C C C C C C C C H H H H H H H H H H H H H H H H H H H H H H H H
charge: -0.444941 0.258193 -0.053038 -0.583227 0.493616 -0.113147 -0.502702 -0.645285 -0.448051 -0.819162 -0.108026 -0.481464 -0.785160 0.488126 -0.833205 -0.736485 0.201119 0.211520 0.222122 0.196059 0.212761 0.222920 0.213074 0.220493 0.223080 0.198838 0.234439 0.215449 0.226785 0.197513 0.210110 0.217642 0.226272 0.219481 0.331810 0.224463 0.224678 0.227447 0.212940 0.222944
chargesum: 0.00000
title: Mulliken charges with hydrogens summed into heavy atoms:
elementType: O C C C C C C C C C C C C C C C
charge: -0.113132 0.258193 0.148080 -0.149584 0.493616 0.082912 -0.067021 -0.211718 -0.026133 -0.142489 0.089487 -0.271354 -0.121765 0.488126 -0.156617 -0.300601
polarizability: 1.95895648e+02 2.13022217e+00 1.56454236e+02 -1.02565278e+00 7.83158612e+00 1.29491407e+02
1716.lowfreq: -12.3905 -0.0007 -0.0006 0.0003 9.0544 11.5918 30.3341 44.9245 100.2852
frequency: 29.6619 44.8891 100.2814 119.0251 124.6009 151.2182 156.3426 177.6592 189.8372 239.1838 258.8989 262.7648 274.3671 292.2797 299.5561 308.5282 314.8469 349.3281 404.3840 425.4609 427.5001 461.8607 477.9293 508.0982 515.5055 541.3328 557.2254 593.5178 651.0006 686.2715 723.6208 798.9555 809.0528 843.8316 868.9926 890.3600 895.2434 895.8456 927.8654 933.6431 940.0269 952.9360 974.7856 981.0124 992.0287 999.4781 1006.3882 1047.2701 1052.9838 1063.7797 1086.0310 1102.7063 1108.7690 1129.4490 1137.9591 1154.5327 1177.6545 1183.9536 1200.1424 1214.6545 1237.4478 1245.2745 1263.9468 1275.4093 1284.4821 1299.9181 1306.0388 1315.1906 1329.1493 1338.5233 1342.9619 1351.2464 1368.4108 1381.2854 1390.6884 1393.1819 1397.0564 1425.0247 1452.1919 1459.6633 1462.8097 1466.1489 1469.7109 1473.5509 1476.0571 1479.9950 1487.2712 1494.2524 1663.9133 1674.4707 2911.3103 2938.0165 2942.2855 2952.6373 2963.6466 2966.6005 2976.4672 2978.9293 2983.3414 3000.4641 3029.2560 3031.5772 3037.1281 3042.7924 3056.3535 3064.0369 3067.8431 3075.0096 3077.3151 3082.0457 3084.7518 3096.4256 3194.7700 3548.3519
redmass: 2.5339 4.0115 2.6976 3.0596 2.7173 1.4915 1.7938 3.1561 1.0908 1.3379 1.3546 1.7994 2.6592 3.1591 2.3910 2.4682 2.5869 2.3961 2.8464 2.6026 3.2459 3.0684 2.9705 2.6042 3.2051 2.6260 2.2970 2.6089 3.0787 1.6698 1.6943 2.3430 1.7663 1.5184 2.1053 2.2677 2.4361 1.8945 1.3380 2.0705 1.7733 2.1201 2.2012 1.7375 1.8361 1.7894 1.6001 1.5564 1.9167 2.2794 1.6727 1.8975 1.9017 1.7026 1.6406 2.7616 1.8018 1.8556 1.9634 1.4568 1.4972 1.5074 1.4521 1.2265 1.3065 1.2917 1.3790 1.3932 1.5554 1.3354 1.5482 1.8720 1.6796 1.2518 1.3959 1.2193 1.3692 1.1818 1.0810 1.0801 1.0522 1.0784 1.0865 1.0629 1.0598 1.0583 1.0544 1.0542 4.8926 8.3532 1.0828 1.0802 1.0823 1.0652 1.0389 1.0598 1.0602 1.0365 1.0364 1.0597 1.0946 1.0992 1.0966 1.1028 1.1021 1.0897 1.0989 1.0980 1.0991 1.0986 1.0979 1.0626 1.1129 1.0661
irintensity: 0.2596 0.7669 0.0115 0.1892 0.7601 0.1639 1.2597 0.1243 0.3741 0.7514 101.5497 27.5224 16.1272 0.4896 14.4517 3.8560 6.0855 3.9859 1.0864 0.0398 0.9629 2.3184 8.6824 1.8656 1.4015 6.4487 3.7999 2.1152 6.2800 0.0795 1.2714 1.4596 2.7989 13.2238 3.3035 42.7555 5.5406 13.7759 67.0544 4.1031 3.6197 43.1697 15.7621 4.3636 2.8577 8.2212 6.8815 4.6429 7.0786 6.8952 21.8063 12.2960 5.9191 1.0263 7.7481 12.3295 3.9379 1.5508 0.6568 5.7782 7.9274 32.9898 0.3005 3.1593 4.9375 18.6828 11.6155 1.0440 0.2793 0.4676 14.3168 2.5379 5.2800 17.8035 18.9817 28.8044 4.5311 1.3356 1.8978 9.6590 15.8092 7.8506 9.4398 10.6685 14.4061 12.2512 21.3666 0.9968 32.7489 13.0224 55.2211 10.4733 23.6613 27.8209 27.8587 26.2073 40.4143 24.2571 28.5651 36.6495 56.5941 11.2934 35.0659 48.3582 19.9601 37.5856 72.0285 34.3969 18.7583 56.2452 24.2121 9.3089 27.2394 4.5344
temp: 298.150 k
press: 1.00000 atm
elementType: 8 6 6 6 6 6 6 6 6 6 6 6 6 6 6 6 1 1 1 1 1 1 1 1 1 1 1 1 1 1 1 1 1 1 1 1 1 1 1 1
symmnumber: 1
zpe: 927966.8 jmol-1
zpe.correction: 0.353444 hartree
zpe.thermalcorrener: 0.370556 hartree
zpe.thermalcorrenthalpy: 0.371500 hartree
zpe.thermalcorrgfe: 0.309794 hartree
zpe.sumelectzpe: -659.922432 hartree
zpe.sumelectthermal: -659.905320 hartree
zpe.sumelectthermalent: -659.904376 hartree
zpe.sumelectthermalfe: -659.966082 hartree
dipole: 1.3177 -0.4580 -0.4212
dipole: 1.4573
quadrupole: -109.5150 -93.4660 -99.5277
quadrupole: 5.9716 5.7425 1.6587
quadrupole: -8.6788 7.3703 1.3085 5.9716 5.7425 1.6587
hfenergy: -660.2758759 hartree
pointgroup: C01 [X(C15H24O1)]
dipole: -0.5143107 -0.1539928 0.2012028 debye
polarizability: 195.814965|-2.6201433|153.7796779|-2.223369|-11.189765|132.2466489 unknown
InChI: InChI=1S/C15H24O/c1-10(2)12-5-6-13-8-14(16)7-11(3)15(13,4)9-12/h8,11-12,14,16H,1,5-7,9H2,2-4H3
charge 0 multiplicity 1
40 atoms
O  4.426951 -0.898288 0.032606
C  0.400563 0.434427 -0.388038
C  1.423242 1.398051 0.324946
C  -1.022936 0.685093 0.219217
C  0.796576 -1.032998 -0.124789
C  -2.104446 -0.355178 -0.203427
C  2.884767 0.956984 0.073336
C  -0.258174 -2.089332 -0.432294
C  -1.629506 -1.764553 0.211491
C  0.370401 0.687217 -1.926911
C  3.155262 -0.435178 0.651664
C  2.01831 -1.39149 0.35666
C  1.247391 2.890351 -0.04183
C  -3.484397 0.042825 0.331597
C  -4.156588 1.202565 -0.387931
C  -4.094971 -0.58258 1.374109
H  1.229191 1.296928 1.416151
H  -1.353369 1.703802 -0.058625
H  -0.950451 0.659806 1.326295
H  -2.17465 -0.336465 -1.313978
H  3.587943 1.688339 0.513256
H  3.100021 0.917147 -1.011056
H  -0.398542 -2.164179 -1.531837
H  0.097785 -3.080898 -0.094953
H  -2.377464 -2.524597 -0.085431
H  -1.529996 -1.813473 1.314462
H  1.387008 0.648009 -2.356037
H  -0.235457 -0.070946 -2.453296
H  -0.065548 1.676938 -2.155557
H  3.307963 -0.37136 1.754114
H  2.22211 -2.456607 0.555667
H  1.899691 3.515611 0.595734
H  1.530601 3.084533 -1.092448
H  0.209549 3.239896 0.103599
H  4.630552 -1.80862 0.369522
H  -3.529424 2.11471 -0.36634
H  -4.323166 0.957522 -1.455761
H  -5.132443 1.451377 0.062873
H  -5.081129 -0.261364 1.730209
H  -3.643522 -1.431323 1.89853
